program: Gaussian 09
title: 000259587
version: EM64L-G09RevD.01
frameworkgroup: C1[X(C11H11N3O6)]
method: RPBEPBE
basis: SDD
operation: Freq
keyword: #p
keyword: freq=noraman
keyword: PBEPBE/SDD
title: #p freq=noraman PBEPBE/SDD
converged: YES YES NO NO
title: Mulliken charges:
elementType: O O O O O O N N N C C C C C C C C C C C H H H H H H H H H H H
charge: -0.411946 -0.198344 -0.190024 -0.223685 -0.215792 -0.208837 -0.161666 0.000686 0.018144 -0.198492 -0.491478 -0.483974 -0.377040 0.353687 0.169517 0.267504 -0.277159 -0.502923 -0.433769 0.430311 0.307091 0.253380 0.251011 0.257406 0.247692 0.253843 0.288329 0.267841 0.327994 0.291952 0.388740
chargesum: 0.00000
title: Mulliken charges with hydrogens summed into heavy atoms:
elementType: O O O O O O N N N C C C C C C C C C C C
charge: -0.023206 -0.198344 -0.190024 -0.223685 -0.215792 -0.208837 -0.161666 0.000686 0.018144 0.108599 0.012913 0.021125 0.165132 0.353687 0.169517 0.267504 -0.009318 -0.174930 -0.141816 0.430311
polarizability: 2.56285266e+02 1.72946504e+01 1.92130324e+02 -1.59811163e+01 1.28501633e+01 1.00332028e+02
1716.lowfreq: -6.5159 -2.6442 -0.0005 -0.0003 0.0004 8.8609 37.7618 44.8643 48.9021
frequency: 37.6474 44.8470 48.8944 61.2963 81.6120 101.9368 131.7612 140.5464 154.6474 179.1590 206.0392 236.2603 259.1464 274.9268 295.2634 318.8358 339.2188 360.8596 408.0193 459.8203 498.0207 504.8077 527.0068 554.9951 592.4540 614.2014 630.8727 640.2870 667.7625 681.4812 706.1287 714.3619 738.9387 751.7340 788.0135 820.7936 830.9626 871.5044 880.0778 912.5075 927.7432 952.4728 959.1767 984.2828 990.7846 1036.6706 1056.4969 1069.8232 1094.5177 1110.3557 1130.0804 1161.8689 1169.2887 1179.2754 1195.3209 1218.4902 1239.4887 1244.8063 1268.3534 1275.6895 1307.1118 1325.9696 1335.2982 1346.7348 1355.0076 1357.1853 1370.4790 1388.3949 1447.3561 1467.6282 1474.3134 1484.5020 1505.2237 1565.8088 1617.2689 1668.2366 2995.2241 3024.2646 3034.8578 3054.9508 3059.0209 3093.9224 3108.6888 3168.1146 3184.8483 3188.1141 3509.9512
redmass: 6.9677 9.3379 7.7600 13.5053 7.2839 6.5979 5.2471 7.8149 5.0537 3.9769 6.4777 4.4978 3.5860 3.8944 3.8561 9.2851 6.8003 7.0327 5.2726 5.3276 7.5399 4.7791 4.4354 2.5649 5.2768 2.2057 1.7531 6.2140 5.9139 8.9191 7.8685 4.3006 4.5726 12.5304 2.8524 2.3154 2.5087 2.1838 3.9433 1.5763 2.6314 1.4450 5.1062 1.7413 1.6133 2.7788 2.4885 1.7128 1.8540 3.2145 3.7090 1.3233 1.4482 1.5828 6.2799 5.5536 1.3284 1.4503 1.4127 1.5894 1.3249 1.4732 1.7713 1.7066 3.1340 8.1386 3.4209 5.5464 4.8883 1.0934 1.1138 1.1302 3.6079 9.2413 7.0095 8.6622 1.0581 1.0628 1.0647 1.1021 1.0865 1.1028 1.1060 1.0879 1.0922 1.0967 1.0643
irintensity: 0.1937 0.7225 0.8229 0.3772 1.1158 1.7941 2.7445 4.7925 1.5109 0.9564 2.8892 1.8345 1.1099 1.0048 0.1733 0.0965 3.0867 5.2673 13.9943 2.6006 2.2977 19.0929 5.9288 10.3165 13.7559 53.8044 63.6361 5.5734 25.3924 27.7616 5.6565 30.9205 9.2691 7.9421 0.4874 17.2671 33.6376 7.8031 6.0548 9.6293 7.4595 20.0388 34.7095 1.0160 1.4031 306.3520 16.5109 4.9221 4.2580 17.8020 7.1213 34.7746 43.1951 14.9032 424.3388 433.4695 9.3697 14.0854 13.9070 48.8358 5.6780 6.0778 32.3988 19.0183 162.2205 46.9175 76.9148 20.1819 31.0261 14.1924 30.5683 6.3620 132.5578 53.4099 303.8777 157.9016 18.3625 16.4195 16.6946 7.7354 11.9195 15.0180 20.6572 1.9662 12.7852 7.7719 40.3618
temp: 298.150 k
press: 1.00000 atm
elementType: 8 8 8 8 8 8 7 7 7 6 6 6 6 6 6 6 6 6 6 6 1 1 1 1 1 1 1 1 1 1 1
symmnumber: 1
zpe: 584801.1 jmol-1
zpe.correction: 0.222739 hartree
zpe.thermalcorrener: 0.240194 hartree
zpe.thermalcorrenthalpy: 0.241138 hartree
zpe.thermalcorrgfe: 0.176110 hartree
zpe.sumelectzpe: -1039.738483 hartree
zpe.sumelectthermal: -1039.721028 hartree
zpe.sumelectthermalent: -1039.720084 hartree
zpe.sumelectthermalfe: -1039.785113 hartree
dipole: 9.3913 -3.0769 -1.5666
dipole: 10.0060
quadrupole: -127.0816 -120.9841 -119.4185
quadrupole: -5.8323 1.4212 1.4100
quadrupole: -4.5869 1.5106 3.0762 -5.8323 1.4212 1.4100
hfenergy: -1039.9612223 hartree
pointgroup: C01 [X(C11H11N3O6)]
dipole: 3.678675 1.0255022 0.955446 debye
polarizability: 257.4072138|-19.3012445|172.8853292|7.2791867|39.1886805|118.4550742 unknown
InChI: InChI=1S/C11H11N3O6/c15-11(16)9-2-1-5-12(9)8-4-3-7(13(17)18)6-10(8)14(19)20/h3-4,6,9,15H,1-2,5H2
charge 0 multiplicity 1
31 atoms
O  2.756397 2.856119 0.969595
O  2.361936 2.203889 -1.23127
O  -1.278675 -2.869793 -2.005249
O  0.251788 -3.139901 -0.329262
O  -4.355524 1.98711 0.68666
O  -4.852929 0.167427 -0.605284
N  1.526279 -0.39581 -0.092563
N  -0.594361 -2.420762 -1.005021
N  -4.020923 0.909992 0.049603
C  2.510441 0.491749 0.575166
C  3.874152 -0.190284 0.267778
C  3.645782 -0.791868 -1.138982
C  2.195891 -1.312868 -1.062134
C  0.16772 -0.206862 0.052839
C  2.507406 1.908026 -0.029422
C  -0.851878 -1.049577 -0.534413
C  -0.31926 0.945863 0.77036
C  -2.205229 -0.661556 -0.576127
C  -1.66592 1.301869 0.785213
C  -2.606045 0.514529 0.072645
H  2.323129 0.570164 1.658586
H  4.050711 -0.984967 1.014117
H  4.71544 0.520069 0.313386
H  3.738173 -0.010124 -1.911614
H  4.355057 -1.602554 -1.370118
H  1.672136 -1.279093 -2.035014
H  2.150318 -2.352441 -0.690624
H  0.385022 1.586691 1.30565
H  -2.940993 -1.299956 -1.072326
H  -2.012342 2.189717 1.320433
H  2.8154 3.766608 0.569791
