program: Gaussian 09
title: 000259592
version: EM64L-G09RevD.01
frameworkgroup: C1[X(C11H18N4O5)]
method: RPBEPBE
basis: SDD
operation: Freq
keyword: #p
keyword: freq=noraman
keyword: PBEPBE/SDD
title: #p freq=noraman PBEPBE/SDD
converged: YES YES NO NO
title: Mulliken charges:
elementType: O O O O O N N N N C C C C C C C C C C C H H H H H H H H H H H H H H H H H H
charge: -0.325581 -0.335958 -0.274384 -0.403802 -0.236737 -0.146801 -0.351462 -0.524517 -0.356781 -0.233575 -0.479904 -0.486030 -0.353592 0.280937 0.211924 -0.469032 -0.513481 0.260185 -0.430715 0.203550 0.301954 0.272380 0.224847 0.234866 0.259033 0.229446 0.239298 0.373662 0.233044 0.235873 0.253283 0.248756 0.279817 0.281517 0.368585 0.261847 0.287070 0.380475
chargesum: 0.00000
title: Mulliken charges with hydrogens summed into heavy atoms:
elementType: O O O O O N N N N C C C C C C C C C C C
charge: -0.325581 -0.335958 -0.274384 -0.023327 -0.236737 -0.146801 0.022200 0.036817 0.011805 0.068379 0.017323 0.007870 0.115152 0.280937 0.211924 -0.000115 -0.011441 0.260185 0.118203 0.203550
polarizability: 1.90834640e+02 -5.26977174e+00 1.70795940e+02 3.55810466e+00 -3.73371478e+00 1.20578991e+02
1716.lowfreq: -9.0731 -3.2187 -0.0012 -0.0012 -0.0008 3.9459 17.9212 23.0964 29.0302
frequency: 17.8517 23.0321 28.9820 40.5107 43.3607 58.2329 68.3447 82.5315 105.6189 130.3162 136.3146 154.8822 170.8662 189.2635 224.9882 244.2724 251.3720 286.1558 299.6662 310.1908 318.6231 347.5326 407.4569 434.1685 477.9957 489.4869 498.5554 548.6575 560.7284 581.6749 618.3148 631.5449 663.3947 668.5529 698.9534 742.7998 764.9443 805.1574 808.5026 826.9636 836.2588 855.1857 863.3840 873.1377 894.7899 900.0788 923.5097 938.8995 986.6757 991.9145 1021.2856 1044.9629 1081.3621 1081.8226 1098.0829 1127.6540 1132.0689 1148.0151 1150.3166 1167.9642 1181.2775 1239.5674 1241.6216 1250.6417 1254.4987 1281.9266 1284.8162 1306.3328 1309.4677 1311.0633 1318.7503 1326.4508 1328.9312 1332.3637 1335.2004 1342.1831 1376.0529 1432.4406 1440.3613 1440.8443 1453.7340 1473.5548 1485.2820 1529.8276 1537.4651 1563.0133 1601.5877 1637.1114 1659.3847 1664.9554 2974.4036 2977.6132 2991.3584 3004.1191 3010.7292 3026.2748 3027.3084 3030.5754 3045.7510 3054.9249 3096.5441 3111.9405 3117.3217 3223.7538 3318.9028 3449.6808 3512.1651 3563.9870
redmass: 6.7273 5.6239 9.7650 1.8456 4.5967 3.9559 6.4341 4.3257 4.8840 3.4425 4.8259 5.1489 3.7201 1.4434 3.1746 3.4773 2.6201 6.1283 5.8540 3.5358 4.0368 4.1376 5.0738 4.6145 2.2658 4.8642 3.7315 2.9298 3.4923 2.7407 2.3695 3.4342 2.2545 2.5331 2.4362 3.6642 4.1672 2.5931 2.4517 2.0784 4.4931 1.2484 1.9364 1.9428 1.5640 1.6890 2.4819 3.7195 2.4281 2.1331 2.7370 3.1916 1.9877 1.8039 2.0195 3.7278 3.2141 1.4923 2.4283 1.4093 1.6607 1.3680 1.4550 1.4801 1.3487 1.6384 1.6806 1.3986 1.3539 2.4197 1.4153 1.3291 1.4571 1.4358 1.3317 1.2100 4.2849 1.0792 1.1129 1.1583 1.0929 1.0909 1.1025 1.9614 2.2626 3.8953 3.8158 5.2118 8.8495 1.0824 1.0626 1.0602 1.0607 1.0653 1.0782 1.0715 1.0667 1.1012 1.0961 1.0988 1.1031 1.1022 1.0983 1.0859 1.0847 1.0461 1.0638 1.0953
irintensity: 0.2451 0.6390 2.0165 5.8425 0.7729 0.8283 0.4199 10.3995 8.2086 0.8527 9.1347 4.3816 3.0336 54.9571 7.1442 8.7405 14.5311 8.7869 16.8699 15.3687 28.4435 18.9353 16.1279 4.2012 16.8444 7.8277 39.8367 3.4326 41.7210 14.0447 31.3738 8.9025 104.3589 23.2029 155.0784 119.7573 111.0124 8.8972 3.1268 103.5901 26.5355 99.5218 1.6303 68.4669 11.8332 1.5364 6.9877 3.4185 5.1626 6.5735 8.0555 3.4990 98.7888 91.0607 4.5163 1.8377 15.1108 2.6172 6.6933 17.3311 4.3698 23.5374 42.4914 15.7006 5.7362 9.8564 9.4475 34.9146 9.5543 34.8186 7.5649 2.5462 17.3222 8.0889 1.9871 1.6535 76.7513 24.1990 10.1226 36.7761 21.9815 21.5361 1.3067 276.1620 305.0780 20.5641 109.7315 316.5541 315.7477 38.4677 38.5130 36.3221 46.2491 20.4709 5.0053 30.4581 15.2202 18.2107 26.0722 4.7062 26.3862 10.9432 5.4905 418.4439 295.0836 3.1169 23.5404 2.7862
temp: 298.150 k
press: 1.00000 atm
elementType: 8 8 8 8 8 7 7 7 7 6 6 6 6 6 6 6 6 6 6 6 1 1 1 1 1 1 1 1 1 1 1 1 1 1 1 1 1 1
symmnumber: 1
zpe: 797647.2 jmol-1
zpe.correction: 0.303808 hartree
zpe.thermalcorrener: 0.324756 hartree
zpe.thermalcorrenthalpy: 0.325700 hartree
zpe.thermalcorrgfe: 0.250246 hartree
zpe.sumelectzpe: -1023.598827 hartree
zpe.sumelectthermal: -1023.577879 hartree
zpe.sumelectthermalent: -1023.576935 hartree
zpe.sumelectthermalfe: -1023.652389 hartree
dipole: 5.8810 4.2022 -0.4754
dipole: 7.2437
quadrupole: -138.6379 -122.6868 -112.0540
quadrupole: 5.6996 1.6331 6.3555
quadrupole: -14.1783 1.7728 12.4056 5.6996 1.6331 6.3555
hfenergy: -1023.9026345 hartree
pointgroup: C01 [X(C11H18N4O5)]
dipole: 2.1401021 1.8789058 0.1072709 debye
polarizability: 191.8400801|-3.5538029|169.1988741|0.0181177|7.0247816|121.1706167 unknown
InChI: InChI=1S/C11H18N4O5/c12-4-9(17)15-3-1-2-7(15)11(20)14-5-8(16)13-6-10(18)19/h7,13-14,18H,1-6,12H2
charge 0 multiplicity 1
38 atoms
O  -0.763047 1.153307 -0.971208
O  2.499972 -1.494667 0.786554
O  -2.731378 -3.002793 -0.688818
O  -3.262673 0.061253 1.829048
O  -5.560057 0.313253 1.602725
N  2.507139 0.7628 0.246603
N  0.0854 -0.95476 -0.455784
N  5.274493 -1.8146 0.311479
N  -2.933506 -0.675235 -0.787068
C  1.087832 0.983806 0.681505
C  0.988228 2.518066 0.801161
C  1.981543 3.032467 -0.271815
C  3.157394 2.031259 -0.195924
C  0.059034 0.4061 -0.332374
C  3.135437 -0.449099 0.39692
C  4.651703 -0.514646 0.071497
C  -0.777026 -1.67603 -1.4080
C  -2.232869 -1.85934 -0.916938
C  -4.291008 -0.662862 -0.265386
C  -4.464491 -0.047513 1.120964
H  0.935514 0.461009 1.644702
H  -0.039773 2.860449 0.608611
H  1.299034 2.838433 1.811934
H  2.312233 4.068072 -0.089638
H  1.502263 2.988555 -1.264935
H  3.91364 2.353842 0.547534
H  3.664429 1.899073 -1.168448
H  0.802249 -1.463696 0.101569
H  5.17979 0.258643 0.663352
H  4.795825 -0.233254 -0.990689
H  -0.359925 -2.680898 -1.570044
H  -0.789899 -1.125078 -2.367954
H  5.241707 -2.09217 1.299081
H  4.86882 -2.558786 -0.26746
H  -2.416306 0.205677 -0.952621
H  -4.987574 -0.132218 -0.939614
H  -4.627506 -1.717528 -0.206557
H  -3.459943 0.431704 2.732437
