program: Gaussian 09
title: 000259599
version: EM64L-G09RevD.01
frameworkgroup: C1[X(C15H21N5O4)]
method: RPBEPBE
basis: SDD
operation: Freq
keyword: #p
keyword: freq=noraman
keyword: PBEPBE/SDD
title: #p freq=noraman PBEPBE/SDD
converged: YES YES NO NO
title: Mulliken charges:
elementType: O O O O N N N N N C C C C C C C C C C C C C C C H H H H H H H H H H H H H H H H H H H H H
charge: -0.445365 -0.211588 -0.295437 -0.299053 -0.390397 -0.097088 -0.400016 -0.657424 -0.634512 -0.403713 -0.140894 -0.378312 -0.453757 0.139027 0.199107 -0.461109 0.177664 0.266357 0.203283 -0.345433 -0.339270 -0.225759 -0.243796 -0.228891 0.244922 0.230380 0.298191 0.218852 0.217468 0.359651 0.201350 0.185114 0.263706 0.262481 0.354306 0.394542 0.277075 0.213011 0.229964 0.228239 0.230297 0.310475 0.334424 0.292634 0.319294
chargesum: 0.00000
title: Mulliken charges with hydrogens summed into heavy atoms:
elementType: O O O O N N N N N C C C C C C C C C C C C C C C
charge: -0.050822 -0.211588 -0.295437 -0.299053 -0.030746 -0.097088 -0.045710 -0.012526 -0.022584 0.071590 0.157297 0.058008 -0.067292 0.139027 0.199107 0.065078 0.177664 0.266357 0.203283 -0.068359 -0.126259 0.004205 -0.015557 0.001406
polarizability: 2.71942369e+02 -2.13817202e+01 1.67587490e+02 -5.73750344e+00 1.28442740e+01 2.01969914e+02
1716.lowfreq: -5.0948 -0.0005 -0.0003 0.0005 2.7079 3.9745 6.6390 9.6809 24.0110
frequency: 2.5457 9.4399 23.9618 28.0687 34.0961 40.9729 51.1789 51.7970 71.3910 83.4620 92.8873 105.9081 117.6490 121.0069 168.7504 181.6388 207.4698 222.8993 231.6126 256.8519 287.0533 299.6837 321.1317 340.3785 380.9838 388.6907 399.2006 408.1063 426.1876 446.3723 452.2514 481.3885 486.7076 535.5722 555.9389 559.6534 573.6056 576.3854 614.6141 621.8351 641.2189 643.8495 649.6170 678.8602 685.8341 687.5438 702.9470 725.0794 752.1271 795.3920 805.4918 852.9494 858.2199 867.5598 877.0914 931.0343 935.6192 949.6666 984.5544 986.1452 989.5311 998.5039 1009.4520 1022.6158 1031.9347 1033.7854 1063.6023 1067.9297 1072.6123 1086.5471 1105.4052 1125.5032 1168.1001 1171.7618 1178.6051 1182.7525 1196.2546 1199.0186 1217.9207 1225.1224 1256.8512 1266.1785 1282.2392 1292.7547 1301.9496 1317.9090 1326.0875 1347.9908 1354.1416 1370.5587 1385.6405 1409.9405 1432.6297 1455.9618 1460.1278 1464.1129 1473.5560 1475.0603 1495.1468 1508.3093 1559.1440 1599.9310 1601.2917 1612.4500 1615.9307 1617.4292 1669.7597 1678.3507 2861.4745 2914.3792 2972.0489 2987.1779 2996.5729 3011.5494 3016.6457 3041.4681 3067.5865 3123.5667 3131.6633 3144.7807 3157.5854 3168.4809 3486.1211 3523.1203 3531.6323 3538.4674 3550.9884 3671.1877 3696.7333
redmass: 4.0710 5.3251 5.6229 4.0748 7.2297 6.3232 5.0058 7.6507 4.9708 4.0412 7.2954 2.8419 3.2870 3.5865 4.9399 4.2160 3.7428 4.4497 3.1496 3.4823 4.6162 5.0024 5.6354 2.6209 1.3120 4.9596 2.7740 1.2897 1.1803 3.8491 3.6396 2.4404 3.7417 3.1529 3.0016 2.2552 1.6667 2.5276 6.3755 1.1957 2.3724 2.7129 1.3219 5.1297 4.4712 4.4668 1.5159 4.6961 1.1599 2.3931 3.3276 1.2552 2.1880 3.4701 4.0664 3.0994 1.4448 4.0992 1.8132 1.5061 6.1464 2.6424 1.3378 2.6718 1.4855 2.0065 2.5858 3.7885 2.7281 1.7624 2.1052 2.4361 1.4698 1.0829 2.1086 2.0149 1.3100 1.0950 1.3479 1.5499 1.5958 1.2863 1.4146 1.2573 1.3501 1.4893 1.5776 1.9363 1.3988 1.5368 8.9490 4.3677 2.2553 1.0758 1.0862 2.1756 1.0889 1.0975 2.3804 2.2382 8.7656 6.8356 1.2430 6.0751 1.2893 5.9524 3.5441 8.9008 1.0585 1.0978 1.0590 1.0607 1.0602 1.1008 1.0821 1.1012 1.1041 1.0852 1.0879 1.0926 1.0957 1.1006 1.0771 1.0450 1.0645 1.0782 1.0455 1.1017 1.1027
irintensity: 0.0489 0.2053 1.0684 2.4864 0.0317 4.2648 2.1870 5.1663 0.9511 1.3572 9.6983 2.1903 1.2976 3.0971 0.1893 3.1951 5.1724 11.1169 29.9616 1.7938 1.7471 8.2860 12.4492 29.5871 54.9382 18.5223 0.2956 226.4362 95.1962 4.0406 8.1344 34.1946 24.1196 67.7490 34.4312 121.8446 105.9879 26.4188 0.2219 44.6103 98.2758 37.3060 112.1101 79.7164 18.1441 5.8147 147.2957 12.8239 14.8935 20.7009 6.6982 0.0553 0.6554 8.5170 22.2645 14.1119 4.4818 58.8109 1.5566 0.0260 0.2080 15.0049 1.1450 5.2809 6.5110 97.8822 68.8959 12.6688 6.6664 16.7627 48.9642 17.4623 24.7588 1.0469 1.1518 1.1135 4.1733 0.1000 1.4323 36.7139 7.3981 6.8925 10.1463 13.6825 15.7688 12.4109 4.4880 25.4500 21.5076 60.0940 1.6004 124.9600 8.2963 10.0055 5.5529 510.0715 84.7784 19.8928 593.7042 3.4383 169.6174 59.6361 141.2187 9.0657 92.3520 56.3351 554.3015 230.5980 75.9942 51.5356 40.4054 7.8719 30.7545 13.0332 12.5823 5.7831 50.2210 6.0384 5.7691 28.0662 15.8809 23.3821 118.4874 20.6999 30.5613 81.1435 17.5954 19.8035 19.6998
temp: 298.150 k
press: 1.00000 atm
elementType: 8 8 8 8 7 7 7 7 7 6 6 6 6 6 6 6 6 6 6 6 6 6 6 6 1 1 1 1 1 1 1 1 1 1 1 1 1 1 1 1 1 1 1 1 1
symmnumber: 1
zpe: 942907.1 jmol-1
zpe.correction: 0.359134 hartree
zpe.thermalcorrener: 0.384462 hartree
zpe.thermalcorrenthalpy: 0.385406 hartree
zpe.thermalcorrgfe: 0.296199 hartree
zpe.sumelectzpe: -1157.087578 hartree
zpe.sumelectthermal: -1157.062250 hartree
zpe.sumelectthermalent: -1157.061306 hartree
zpe.sumelectthermalfe: -1157.150513 hartree
dipole: -4.4220 -2.1744 -1.3431
dipole: 5.1074
quadrupole: -117.0073 -127.3599 -140.3016
quadrupole: 14.8084 -11.7970 13.4762
quadrupole: 11.2156 0.8630 -12.0786 14.8084 -11.7970 13.4762
hfenergy: -1157.4467123 hartree
pointgroup: C01 [X(C15H21N5O4)]
dipole: -1.6212279 -0.9525825 -0.7084971 debye
polarizability: 275.6553816|-9.7416364|161.9151075|-5.8264755|6.8180162|203.9292835 unknown
InChI: InChI=1S/C15H21N5O4/c16-15(17)18-8-4-7-11(14(23)24)20-12(21)9-19-13(22)10-5-2-1-3-6-10/h1-3,5-6,11,19-20,23H,4,7-9,16-17H2
charge 0 multiplicity 1
45 atoms
O  -3.001453 2.879343 1.565576
O  -4.077185 3.396001 -0.429743
O  0.569511 1.23472 -1.213978
O  3.5858 0.274154 2.511978
N  -1.002731 1.619524 0.455313
N  -4.612184 -2.353234 0.175821
N  2.534184 0.615431 0.485789
N  -5.720918 -3.716979 -1.507826
N  -6.146333 -4.026929 0.779899
C  -2.734113 0.720244 -1.16006
C  -2.07154 1.96872 -0.493743
C  -3.427507 -0.228995 -0.163964
C  -4.008115 -1.481657 -0.850384
C  -3.144279 2.825791 0.16795
C  0.253293 1.281234 0.019916
C  1.273248 0.964247 1.125662
C  3.639289 0.277607 1.236157
C  4.901835 -0.080986 0.491254
C  -5.432819 -3.309335 -0.194294
C  6.058507 -0.33195 1.272916
C  4.988065 -0.184842 -0.922562
C  7.280032 -0.674304 0.657746
C  6.211392 -0.528503 -1.538555
C  7.360879 -0.772691 -0.751454
H  -1.930746 0.191712 -1.706621
H  -3.457718 1.091719 -1.911308
H  -1.622344 2.569476 -1.308215
H  -2.715257 -0.567803 0.611794
H  -4.254154 0.284915 0.364358
H  -1.2178 1.676105 1.453782
H  -3.180112 -2.004324 -1.385619
H  -4.742046 -1.160217 -1.631519
H  0.913142 0.132024 1.763274
H  1.400879 1.835689 1.799301
H  2.521223 0.66166 -0.538831
H  -3.739599 3.415728 1.961284
H  5.964283 -0.252149 2.36093
H  4.114092 -0.01233 -1.561653
H  8.166652 -0.864528 1.27258
H  6.267057 -0.60769 -2.629849
H  8.308835 -1.038919 -1.232357
H  -6.600328 -4.182486 -1.721101
H  -5.187043 -3.327718 -2.279244
H  -6.322744 -5.020672 0.637193
H  -5.99183 -3.709498 1.735806
