program: Gaussian 09
title: 000259588
version: EM64L-G09RevD.01
frameworkgroup: C1[X(C11H12N4O7)]
method: RPBEPBE
basis: SDD
operation: Freq
keyword: #p
keyword: freq=noraman
keyword: PBEPBE/SDD
title: #p freq=noraman PBEPBE/SDD
converged: YES YES NO NO
title: Mulliken charges:
elementType: O O O O O O O N N N N C C C C C C C C C C C H H H H H H H H H H H H
charge: -0.408082 -0.205775 -0.261474 -0.184349 -0.267179 -0.209916 -0.203540 -0.396606 0.025921 -0.618321 0.017095 -0.188938 -0.456683 -0.546531 0.340724 0.166625 0.238294 -0.274652 0.240143 -0.500210 0.448233 -0.416357 0.289017 0.280279 0.250357 0.370872 0.226260 0.284914 0.272683 0.336989 0.294251 0.390091 0.341850 0.324017
chargesum: 0.00000
title: Mulliken charges with hydrogens summed into heavy atoms:
elementType: O O O O O O O N N N N C C C C C C C C C C C
charge: -0.017992 -0.205775 -0.261474 -0.184349 -0.267179 -0.209916 -0.203540 -0.025734 0.025921 0.047546 0.017095 0.100078 0.073953 -0.035357 0.340724 0.166625 0.238294 -0.001969 0.240143 -0.163221 0.448233 -0.122106
polarizability: 2.82770155e+02 7.46998272e+00 2.08144255e+02 -8.13245994e+00 1.68309889e+01 9.59826433e+01
1716.lowfreq: -8.9245 -4.9375 -0.0007 -0.0005 -0.0004 3.4698 18.0643 28.6490 33.2246
frequency: 18.0607 28.5499 33.2197 35.5466 45.2172 52.6408 57.2806 75.8627 98.3555 123.6052 142.9425 161.9257 166.4397 182.7254 219.9381 268.5080 274.8548 320.9574 337.2734 343.7843 384.0062 422.9434 434.7141 443.0632 492.6977 499.0166 506.9496 517.0078 539.9312 583.4687 595.6353 626.0917 637.8349 652.2542 654.6132 658.8351 683.1325 706.7666 723.7856 729.9932 754.6804 759.1493 776.2572 816.0416 832.8679 842.2360 876.0543 894.8443 953.6878 967.1919 997.0889 1024.1322 1032.6343 1049.6011 1058.9659 1099.2531 1109.4729 1117.3088 1150.6657 1166.7980 1195.8269 1216.0328 1239.2617 1248.5804 1255.1746 1284.6345 1291.7101 1312.5486 1345.4881 1348.8200 1361.5026 1366.7509 1380.9782 1385.3521 1452.2785 1453.9318 1472.4316 1489.8752 1526.6407 1585.0809 1600.2489 1629.1917 1648.8782 1668.2351 2982.4741 3008.3266 3022.5890 3037.5635 3078.2973 3165.1805 3186.6477 3188.0717 3317.0236 3511.4286 3516.4908 3670.6457
redmass: 9.7058 7.4130 7.4728 6.7776 7.9163 4.9298 13.2845 9.8842 6.3790 5.3032 4.7385 6.3108 5.2723 9.4463 3.6688 5.9120 4.6324 8.8468 6.3758 8.6189 10.4594 2.8155 4.8030 4.5422 1.9724 2.7366 6.3432 3.5817 1.4282 2.2386 3.6782 2.2703 4.5907 3.4523 4.5307 1.8023 7.2487 7.5728 4.9475 3.0253 12.5008 1.9618 1.4162 4.5732 1.7098 1.9937 4.2404 4.4073 3.0241 1.4171 1.3373 2.3943 2.9702 2.1870 1.8881 2.9828 3.5642 2.8751 1.3732 5.5825 1.5053 3.8606 1.5325 1.5305 1.6022 1.5216 1.2588 2.6047 3.1821 1.7500 2.0633 3.3974 2.0987 4.4371 4.8970 1.0891 1.0935 2.7216 3.7405 4.1793 1.4358 7.2018 3.4881 8.7378 1.0596 1.0663 1.0809 1.0995 1.1025 1.0887 1.0940 1.0947 1.0789 1.0643 1.0449 1.1045
irintensity: 0.5178 0.5424 8.3147 9.2223 1.3440 1.4417 0.1582 0.9828 1.2322 2.1362 4.6068 2.5976 2.7289 5.3720 6.2639 6.2281 1.6927 0.2208 0.4445 0.4174 0.4225 2.8737 7.0351 3.3541 24.9790 27.5532 3.8240 15.0959 173.8247 67.8475 33.8797 32.5383 8.3098 56.3798 59.7189 76.3762 11.1789 11.9368 8.7177 1.7852 15.5967 12.4995 72.1796 1.4138 1.9362 44.3799 0.8896 9.2404 4.3821 23.6054 0.4662 28.8446 264.1074 9.9792 19.0898 65.7475 17.2691 4.9573 35.4700 333.1493 191.6379 293.6410 14.9992 37.3696 25.5602 70.1265 27.3637 132.0611 149.5409 40.2987 10.8784 101.5140 140.6616 39.1545 5.4825 9.7740 32.5161 29.6749 136.7709 141.1081 79.7754 391.8940 284.0585 165.2808 9.6852 4.9836 17.3260 12.3855 9.4576 2.0795 6.8579 17.1508 101.5014 42.5166 38.8523 28.6962
temp: 298.150 k
press: 1.00000 atm
elementType: 8 8 8 8 8 8 8 7 7 7 7 6 6 6 6 6 6 6 6 6 6 6 1 1 1 1 1 1 1 1 1 1 1 1
symmnumber: 1
zpe: 635238.3 jmol-1
zpe.correction: 0.241949 hartree
zpe.thermalcorrener: 0.262916 hartree
zpe.thermalcorrenthalpy: 0.263860 hartree
zpe.thermalcorrgfe: 0.188109 hartree
zpe.sumelectzpe: -1170.191478 hartree
zpe.sumelectthermal: -1170.170511 hartree
zpe.sumelectthermalent: -1170.169567 hartree
zpe.sumelectthermalfe: -1170.245318 hartree
dipole: 5.8228 -1.6078 -0.4039
dipole: 6.0542
quadrupole: -166.3931 -124.2056 -128.7086
quadrupole: 16.7154 9.5061 -1.7706
quadrupole: -26.6240 15.5635 11.0605 16.7154 9.5061 -1.7706
hfenergy: -1170.4334272 hartree
pointgroup: C01 [X(C11H12N4O7)]
dipole: 2.3015833 -0.5666138 0.2348844 debye
polarizability: 268.6211872|-41.9981574|104.9629314|-21.4110413|-9.6066541|213.312935 unknown
InChI: InChI=1S/C11H12N4O7/c12-10(16)4-3-8(11(17)18)13-7-2-1-6(14(19)20)5-9(7)15(21)22/h1-2,5,8,13,17H,3-4,12H2
charge 0 multiplicity 1
34 atoms
O  2.404243 -0.106642 2.975217
O  2.216088 1.49859 1.298843
O  5.607629 -1.617194 -0.562425
O  -2.275408 0.679898 -3.016017
O  -0.146188 0.019119 -2.564992
O  -5.083111 0.810176 2.586381
O  -5.598996 1.199449 0.393842
N  0.563972 -0.495613 -0.102834
N  -1.367415 0.319631 -2.179361
N  5.289926 -0.625226 -2.634392
N  -4.774574 0.864714 1.330471
C  1.61848 -0.880064 0.83583
C  2.831676 -1.47441 0.066365
C  3.432663 -0.543642 -1.01059
C  -0.715027 -0.153695 0.23997
C  2.087445 0.319471 1.682271
C  -1.695347 0.239559 -0.754483
C  -1.158246 -0.179094 1.608458
C  4.862382 -0.988932 -1.370701
C  -3.01812 0.572287 -0.395038
C  -3.392964 0.520823 0.952178
C  -2.464558 0.146698 1.961865
H  1.252231 -1.652399 1.537222
H  3.628104 -1.724731 0.789694
H  2.508811 -2.426941 -0.393013
H  0.774311 -0.405137 -1.11103
H  2.809694 -0.51133 -1.924941
H  3.493619 0.495046 -0.629257
H  -0.451661 -0.458875 2.394057
H  -3.735691 0.866015 -1.165409
H  -2.795904 0.124188 3.003394
H  2.786604 0.647128 3.502084
H  6.245891 -0.851172 -2.909459
H  4.68924 -0.127396 -3.289505
