program: Gaussian 09
title: 000259586
version: EM64L-G09RevD.01
frameworkgroup: C1[X(C10H19N3O4)]
method: RPBEPBE
basis: SDD
operation: Freq
keyword: #p
keyword: freq=noraman
keyword: PBEPBE/SDD
title: #p freq=noraman PBEPBE/SDD
converged: YES YES NO NO
title: Mulliken charges:
elementType: O O O O N N N C C C C C C C C C C H H H H H H H H H H H H H H H H H H H
charge: -0.279176 -0.304324 -0.449545 -0.210705 -0.382196 -0.385869 -0.523147 -0.428007 -0.035386 -0.156647 -0.706902 -0.721228 0.191730 0.221181 -0.388000 -0.524544 0.183937 0.225295 0.215545 0.192549 0.250361 0.203326 0.203199 0.273118 0.208010 0.211758 0.225025 0.324272 0.376687 0.278307 0.285324 0.222742 0.245831 0.270506 0.289486 0.397485
chargesum: 0.00000
title: Mulliken charges with hydrogens summed into heavy atoms:
elementType: O O O O N N N C C C C C C C C C C
charge: -0.279176 -0.304324 -0.052060 -0.210705 -0.057923 -0.009182 0.036845 0.012834 0.157163 0.093714 -0.027260 -0.076435 0.191730 0.221181 0.175631 -0.055970 0.183937
polarizability: 1.71961096e+02 -2.55465163e+00 1.40063849e+02 -1.12003891e+00 -1.17816665e+01 1.15122165e+02
1716.lowfreq: -19.4287 -0.0001 0.0007 0.0007 2.3712 6.7717 9.1135 11.7588 38.4837
frequency: -16.3073 7.9908 38.4423 38.7140 51.7502 62.1961 67.1292 80.9496 109.8432 113.6931 156.5039 186.7423 207.2078 222.6650 227.1897 243.8041 255.1900 273.9010 295.7898 311.4889 337.7847 365.9786 383.6668 466.6473 491.8224 517.4899 544.8626 550.2740 564.8183 610.6585 632.8778 650.7979 662.1118 684.6539 722.8023 764.4427 801.2648 818.1118 863.7072 887.0753 902.3915 922.2033 950.7505 956.4539 967.7770 978.4630 993.0268 1061.2386 1078.5591 1100.0812 1115.7805 1128.2051 1138.4828 1165.4076 1196.9406 1210.2895 1213.8677 1225.5231 1253.7270 1259.1884 1299.7621 1306.8510 1316.6171 1322.8692 1329.3805 1343.4991 1351.2969 1354.3562 1381.8751 1404.4003 1440.1811 1450.4125 1460.1014 1467.5708 1478.3593 1480.1021 1490.2240 1494.6032 1502.1940 1601.5243 1618.0363 1661.9694 1686.4407 2958.4634 2960.9509 2970.5738 2980.9160 2982.5579 2988.7671 3024.8267 3036.5623 3040.7784 3042.7913 3050.5367 3063.4418 3068.6463 3075.9473 3438.8402 3482.0345 3534.4983 3541.1278 3555.2797
redmass: 3.3288 4.9996 5.5267 3.7679 7.3301 3.5433 3.0712 4.5577 3.4719 3.3330 3.2721 2.9727 3.0667 1.4768 1.2774 2.2170 1.3770 3.2217 5.8042 4.4039 2.5636 2.1969 2.5026 4.1421 1.8892 2.7469 3.8444 3.3221 3.9160 1.1697 1.3321 1.4548 2.7726 4.3813 2.7223 2.6739 3.3779 3.8182 2.0351 1.9905 2.9760 1.2328 2.9088 1.7151 2.0445 2.0528 2.4387 3.2139 2.0346 3.2833 1.7304 2.3059 1.6871 2.2663 1.9882 1.1284 1.5122 1.5503 1.4023 1.4701 1.9190 1.6512 1.3432 1.3777 1.5141 1.4005 1.4499 1.3000 1.2179 1.2069 1.0886 1.1027 1.0771 1.0493 1.6447 1.0770 1.1299 2.0203 1.0700 8.0511 5.9577 1.0811 9.3135 1.0781 1.0371 1.0369 1.0609 1.0655 1.0637 1.0840 1.0957 1.1015 1.0999 1.0996 1.0992 1.0977 1.1001 1.0456 1.0765 1.0646 1.0784 1.0953
irintensity: 0.3285 0.1562 4.0428 1.4741 3.2581 0.7242 3.9590 5.5429 2.0162 3.5564 2.3171 8.7301 3.3724 76.5093 0.0530 6.4520 5.5502 20.8220 11.7899 16.9672 17.7745 1.2120 11.2185 6.1492 39.6077 11.1519 39.4226 2.7822 19.5304 14.0234 80.8408 227.5298 37.0492 19.9100 101.0960 237.4003 2.6211 22.6877 29.3605 15.9489 2.1424 2.1601 6.5626 1.9681 0.8059 0.9817 14.3168 2.4816 211.4708 1.4939 1.8610 3.9647 10.2730 16.3709 7.3143 8.7642 6.3834 9.4076 43.1233 15.4171 48.8928 27.4554 6.8240 0.9013 3.6554 16.0728 13.2695 3.1524 13.3421 21.3563 16.3833 29.2038 9.3771 4.4363 356.1760 20.2691 22.4640 215.7481 37.9152 263.9637 45.5618 34.5032 276.5694 13.6810 37.7185 36.2002 25.2045 44.5152 24.9467 7.6708 3.8925 20.7967 27.3414 54.8768 23.7266 63.8675 23.9605 1.4521 51.3624 30.8147 70.3592 2.3640
temp: 298.150 k
press: 1.00000 atm
elementType: 8 8 8 8 7 7 7 6 6 6 6 6 6 6 6 6 6 1 1 1 1 1 1 1 1 1 1 1 1 1 1 1 1 1 1 1
symmnumber: 1
zpe: 778359.6 jmol-1
zpe.correction: 0.296462 hartree
zpe.thermalcorrener: 0.315809 hartree
zpe.thermalcorrenthalpy: 0.316754 hartree
zpe.thermalcorrgfe: 0.245702 hartree
zpe.sumelectzpe: -856.289568 hartree
zpe.sumelectthermal: -856.270220 hartree
zpe.sumelectthermalent: -856.269276 hartree
zpe.sumelectthermalfe: -856.340328 hartree
dipole: -2.7128 2.8334 -0.1181
dipole: 3.9244
quadrupole: -118.7297 -103.8712 -102.4628
quadrupole: -6.8607 10.2453 3.7395
quadrupole: -10.3752 4.4834 5.8918 -6.8607 10.2453 3.7395
hfenergy: -856.5860297 hartree
pointgroup: C01 [X(C10H19N3O4)]
dipole: 0.8621984 1.2387816 0.3254421 debye
polarizability: 170.1695254|5.2623618|138.0440859|5.0448782|15.3213791|118.9334981 unknown
InChI: InChI=1S/C10H19N3O4/c1-6(2)3-7(13-8(14)4-11)10(17)12-5-9(15)16/h6-7,12-13,15H,3-5,11H2,1-2H3
charge 0 multiplicity 1
36 atoms
O  0.843342 -1.477148 -1.411321
O  -3.100514 -0.4953 0.977042
O  3.515725 1.042967 1.758364
O  5.298291 -0.276084 1.049289
N  -1.709906 -0.672468 -0.887531
N  1.70455 -0.163802 0.298325
N  -4.70869 -2.702193 0.058229
C  -0.547941 1.583236 -1.103723
C  -1.130538 2.799693 -0.329087
C  -0.644807 0.195529 -0.369999
C  -2.653264 2.686713 -0.082039
C  -0.367294 3.059038 0.993596
C  0.687233 -0.568293 -0.534411
C  -2.838852 -0.999051 -0.161626
C  3.04409 -0.741958 0.188588
C  -3.808769 -1.991506 -0.856175
C  4.084086 -0.002172 1.010561
H  -1.063915 1.48198 -2.077326
H  0.515496 1.800495 -1.328491
H  -0.95855 3.67936 -0.985907
H  -0.863608 0.349553 0.703346
H  -3.202626 2.559411 -1.033929
H  -3.03401 3.602479 0.407967
H  -2.896596 1.826474 0.567357
H  0.724479 3.141233 0.825204
H  -0.549924 2.2552 1.733268
H  -0.708228 4.00151 1.459439
H  -1.444671 -1.236426 -1.70329
H  1.556809 0.567113 0.998489
H  3.055028 -1.802574 0.511365
H  3.373669 -0.755933 -0.867575
H  -3.23745 -2.726541 -1.454801
H  -4.418249 -1.40844 -1.574917
H  -4.217335 -3.38868 0.642683
H  -5.231612 -2.049932 0.655628
H  4.217349 1.499517 2.295208
