program: Gaussian 09
title: 000259639
version: EM64L-G09RevD.01
frameworkgroup: C1[X(C24H22O6)]
method: RPBEPBE
basis: SDD
operation: Freq
keyword: #pfreq=noraman
keyword: PBEPBE/SDD
title: #p freq=noraman PBEPBE/SDD
converged: YES YES NO NO
title: Mulliken charges:
elementType: O O O O O O C C C C C C C C C C C C C C C C C C C C C C C C H H H H H H H H H H H H H H H H H H H H H H
charge: -0.287941 -0.287954 -0.265081 -0.265083 -0.220711 -0.220749 0.299832 0.299849 0.225853 0.225862 0.044367 0.044401 -0.373588 -0.373580 -0.350270 -0.350365 0.142108 0.142071 -0.498527 -0.498500 0.322746 0.322806 -0.346646 -0.346658 -0.346113 -0.346107 -0.520337 -0.520391 -0.537022 -0.537025 0.276247 0.276232 0.268621 0.268575 0.284989 0.284919 0.247153 0.247158 0.246033 0.246033 0.203668 0.228489 0.265781 0.228469 0.265864 0.203657 0.221942 0.247380 0.221112 0.221113 0.247379 0.221940
chargesum: 0.00000
title: Mulliken charges with hydrogens summed into heavy atoms:
elementType: O O O O O O C C C C C C C C C C C C C C C C C C C C C C C C
charge: -0.287941 -0.287954 -0.265081 -0.265083 -0.220711 -0.220749 0.299832 0.299849 0.225853 0.225862 0.044367 0.044401 -0.097341 -0.097348 -0.081649 -0.081791 0.142108 0.142071 -0.213538 -0.213581 0.322746 0.322806 -0.099494 -0.099500 -0.100080 -0.100073 0.177601 0.177599 0.153412 0.153408
polarizability: 3.92345691e+02 3.20381637e-02 3.45596221e+02 1.16746496e-02 9.99218918e+00 1.78957955e+02
1716.lowfreq: -4.8328 -0.0006 0.0005 0.0006 4.2950 4.9746 14.6119 14.8808 29.7188
frequency: 14.6005 14.8267 29.7182 30.4463 58.4418 67.0042 74.6665 76.6944 81.3143 102.0462 106.0382 108.4358 109.8578 144.5218 145.4058 153.3461 154.0105 181.3047 185.0364 205.1273 212.4896 213.0323 225.8720 232.6479 253.9252 258.9507 264.3845 296.2701 319.6801 356.2034 363.8774 374.6210 405.5409 409.8453 418.0166 421.0885 428.3969 440.9905 454.9469 505.1371 520.0492 525.8889 545.8102 561.5927 587.7074 592.8864 628.0114 659.8708 670.4605 675.4697 676.9501 701.9714 714.4621 729.5888 759.6957 768.4261 797.3671 816.6992 821.9629 822.3541 832.2630 862.7699 885.6065 900.4819 903.7159 928.3141 932.2891 937.3387 937.4920 955.1508 955.2510 988.9964 1004.3048 1006.2446 1006.4707 1016.1981 1094.5796 1101.5515 1111.3481 1111.9662 1113.0978 1113.1001 1117.0449 1133.4442 1136.5679 1152.0479 1152.1596 1163.0698 1164.5541 1187.2235 1190.0932 1193.9024 1222.6177 1223.1809 1253.4841 1254.2852 1271.5951 1285.8869 1304.3461 1364.3662 1364.7570 1375.9064 1401.5131 1402.2683 1407.6023 1424.2359 1424.7400 1437.9579 1438.1909 1451.5678 1451.6852 1467.6621 1467.8391 1472.0884 1472.5644 1475.5353 1476.9822 1481.8126 1481.9055 1486.0669 1535.9942 1547.9366 1564.6289 1569.6094 1581.4707 1613.4767 1613.9986 1614.4817 2958.8783 2958.9755 2962.5426 2962.7108 3046.4965 3046.6099 3071.5200 3071.5421 3122.6039 3122.6212 3127.3596 3127.4167 3146.5015 3146.6855 3146.6997 3149.3008 3158.4055 3158.7348 3165.1429 3169.3956 3169.6194 3169.7290
redmass: 5.4956 5.2372 5.2397 6.5497 4.3588 3.6591 3.9704 3.5403 5.5253 2.9346 4.6614 4.2398 2.7583 5.8861 2.9727 1.5473 1.1169 4.1720 4.5305 3.2699 2.3403 1.8807 3.9463 3.0083 2.0082 1.9114 4.0081 4.7127 8.1833 7.7530 6.5553 5.8632 2.9331 7.0765 3.9497 4.1147 6.0281 5.0500 4.8860 5.9046 4.8118 4.3345 3.4768 3.5782 4.8157 4.0463 7.0111 6.4925 5.5817 5.4976 4.6018 5.1502 6.9132 3.7584 3.8373 3.1443 4.2059 6.4010 1.6046 1.6940 6.6738 1.3499 1.7183 1.5967 1.5322 4.9197 4.8198 1.4638 1.4944 5.9604 5.9107 1.3598 1.7993 4.3387 3.5393 2.1140 2.8636 2.0880 1.2685 1.3048 1.2603 1.2598 1.3623 1.5434 1.5547 1.3352 1.3341 1.3973 1.4082 1.4328 2.1934 1.6428 4.4204 5.4023 1.6074 1.5933 3.3645 4.2472 1.2811 8.7313 8.7772 5.7427 2.8607 2.9799 3.7087 1.3922 1.4049 1.1841 1.1877 1.0583 1.0569 1.0524 1.0527 1.2360 1.1454 1.8293 2.1324 1.0577 1.0591 2.5672 8.3663 8.8102 6.7890 7.9227 8.7527 6.4070 6.8177 6.6758 1.0331 1.0332 1.0339 1.0339 1.1040 1.1040 1.0989 1.0989 1.1034 1.1034 1.0992 1.0992 1.0879 1.0879 1.0879 1.0878 1.0919 1.0915 1.0956 1.0969 1.0957 1.0960
irintensity: 0.0351 0.7913 1.2989 0.0043 4.2276 0.9136 0.0277 0.0147 8.1200 4.7705 0.0507 3.6769 9.1744 11.9860 0.4697 0.2806 1.3156 2.6244 4.5481 7.5686 0.0200 3.7372 0.6358 4.5225 0.3268 9.9418 0.2631 7.4655 3.4805 9.5916 2.7612 14.8817 0.1203 8.0236 5.2260 5.5186 2.8349 16.1997 0.7131 0.0022 4.3690 2.3813 15.1742 0.3308 31.9446 21.6293 0.2067 4.1132 2.3702 14.3131 48.4965 0.7386 9.2390 4.7980 1.7917 26.7902 1.2991 47.3860 61.2930 31.5917 10.2373 6.0068 24.5772 71.4938 13.2093 193.2163 2.5863 4.8597 8.5302 7.7025 74.3400 0.0029 16.0442 130.3853 0.0855 0.0336 1.2095 15.6028 0.3804 18.3216 0.0346 0.0831 9.5936 18.1238 5.3490 1.4749 0.0309 17.7931 2.3645 112.8657 106.1895 229.8671 29.0311 10.3602 66.7370 20.9017 526.1437 230.4810 5.0141 13.8152 4.3698 0.0308 13.4330 96.6263 32.9834 1.6547 17.6287 34.6538 5.2062 1.0043 15.6228 5.5300 24.4585 17.9102 130.7706 24.6746 99.2646 4.8849 10.3429 100.5080 85.2237 398.3377 20.4423 12.8552 32.4694 13.1836 0.0584 7.6347 26.0679 117.0669 182.4670 19.2513 30.4974 63.2953 8.6129 37.7426 1.4582 45.2521 6.3584 35.3798 8.5728 12.8662 0.7165 0.2211 1.2128 2.1761 6.7423 3.2885 12.8584 9.7015
temp: 298.150 k
press: 1.00000 atm
elementType: 8 8 8 8 8 8 6 6 6 6 6 6 6 6 6 6 6 6 6 6 6 6 6 6 6 6 6 6 6 6 1 1 1 1 1 1 1 1 1 1 1 1 1 1 1 1 1 1 1 1 1 1
symmnumber: 1
zpe: 1050371.2 jmol-1
zpe.correction: 0.400065 hartree
zpe.thermalcorrener: 0.429151 hartree
zpe.thermalcorrenthalpy: 0.430095 hartree
zpe.thermalcorrgfe: 0.337586 hartree
zpe.sumelectzpe: -1376.878161 hartree
zpe.sumelectthermal: -1376.849075 hartree
zpe.sumelectthermalent: -1376.848131 hartree
zpe.sumelectthermalfe: -1376.940640 hartree
dipole: -0.0003 7.4967 0.6667
dipole: 7.5263
quadrupole: -129.2597 -154.1763 -180.8147
quadrupole: -0.0007 -0.0125 5.7884
quadrupole: 25.4905 0.5740 -26.0645 -0.0007 -0.0125 5.7884
hfenergy: -1377.2782261 hartree
pointgroup: C01 [X(C24H22O6)]
dipole: 0.0009903 2.9571066 -0.1532456 debye
polarizability: 392.3456272|-0.0437514|346.1063326|0.0958848|-3.8188021|178.4479073 unknown
InChI: InChI=1S/C24H22O6/c1-27-17-9-11-21(29-3)19(13-17)23(25)15-5-7-16(8-6-15)24(26)20-14-18(28-2)10-12-22(20)30-4/h5-14H,1-4H3
charge 0 multiplicity 1
52 atoms
O  5.175203 -1.800864 -1.600939
O  -5.172297 -1.798106 -1.607287
O  3.763248 3.213053 0.568669
O  -3.763425 3.214026 0.568414
O  3.508727 -2.657601 0.707526
O  -3.509264 -2.656477 0.702943
C  1.422746 -1.537521 0.290049
C  -1.422423 -1.536904 0.288404
C  3.727222 -0.414532 -0.152324
C  -3.726164 -0.412909 -0.155847
C  2.926001 -1.607366 0.295888
C  -2.92573 -1.606218 0.292505
C  0.700786 -2.464224 1.093633
C  -0.701784 -2.463928 1.092805
C  0.705786 -0.626549 -0.530189
C  -0.7041 -0.62626 -0.531026
C  4.879226 -0.566975 -0.985487
C  -4.877127 -0.564676 -0.99055
C  3.391668 0.874738 0.325089
C  -3.391355 0.875954 0.323205
C  4.193163 1.997835 0.012302
C  -4.192519 1.999281 0.010383
C  5.657471 0.563396 -1.310701
C  -5.655079 0.565917 -1.315704
C  5.333939 1.845341 -0.813904
C  -5.332235 1.847452 -0.817407
C  6.173587 -2.6422 -0.902531
C  -6.170806 -2.640376 -0.910199
C  4.557761 4.407841 0.27449
C  -4.557628 4.409019 0.274237
H  1.269558 -3.175825 1.70072
H  -1.271571 -3.175288 1.699221
H  1.250929 0.063181 -1.181876
H  -1.248159 0.063656 -1.18341
H  2.519782 1.023958 0.969417
H  -2.520403 1.024637 0.968913
H  6.512533 0.429497 -1.981703
H  -6.509324 0.432539 -1.98785
H  5.960348 2.70125 -1.081556
H  -5.958382 2.703553 -1.085063
H  7.124514 -2.089459 -0.765911
H  6.334986 -3.508309 -1.562284
H  5.766647 -2.967553 0.070468
H  -6.331465 -3.505999 -1.570768
H  -5.76434 -2.96639 0.062781
H  -7.122023 -2.088102 -0.77371
H  5.595484 4.303614 0.647324
H  4.053091 5.22617 0.808304
H  4.572875 4.624535 -0.811619
H  -4.571299 4.626686 -0.811697
H  -4.053735 5.226904 0.809464
H  -5.595842 4.304379 0.645584
