program: Gaussian 09
title: 000023532
version: EM64L-G09RevD.01
frameworkgroup: C1[X(C7H6ClNO3)]
method: RPBEPBE
basis: SDD
operation: Freq
keyword: #p
keyword: freq=noraman
keyword: PBEPBE/SDD
title: #p freq=noraman PBEPBE/SDD
converged: NO NO NO NO
title: Mulliken charges:
elementType: Cl O O O N C C C C C C C H H H H H H
charge: -0.024704 -0.376878 -0.184317 -0.269643 0.032194 0.614119 0.287940 -0.516048 0.157141 -0.292928 -0.337166 -0.791476 0.275462 0.309120 0.254739 0.254723 0.234640 0.373081
chargesum: 0.00000
title: Mulliken charges with hydrogens summed into heavy atoms:
elementType: Cl O O O N C C C C C C C
charge: -0.024704 -0.003796 -0.184317 -0.269643 0.032194 0.614119 0.287940 -0.240586 0.157141 -0.292928 -0.028046 -0.047374
polarizability: 1.66349291e+02 -4.50047038e+00 1.25221011e+02 6.02376954e-03 -1.71675662e-03 4.40545648e+01
1716.lowfreq: -11.5424 0.0014 0.0016 0.0017 3.2371 9.5099 73.1633 104.6395 131.6132
frequency: 73.1613 104.6349 131.6111 143.7792 184.6173 238.6190 254.0634 331.0904 344.0502 346.4810 373.3810 432.0447 436.8632 565.1906 591.0225 596.7585 663.7061 671.1488 704.9110 720.4387 782.3132 833.2762 874.7966 903.4291 976.1877 1007.1275 1045.1524 1078.0625 1155.0370 1180.3377 1224.2735 1266.5856 1286.7680 1358.3246 1398.0760 1403.3811 1456.3125 1456.5627 1465.1239 1489.4421 1561.4984 1627.2080 2988.5299 2991.1080 3068.5023 3110.2137 3171.8588 3189.6996
redmass: 7.9476 6.2529 1.0886 6.8329 16.8302 4.0109 3.8525 6.0801 8.3682 8.7075 8.7371 7.9622 3.1592 4.5849 5.5690 6.4955 8.7868 4.6639 6.2070 6.3652 8.0826 1.0831 1.3728 1.3742 3.2416 1.5598 1.5544 7.1505 3.0971 2.6336 1.4122 4.1485 2.3265 9.0443 2.0037 1.8000 2.9456 1.0463 1.4985 2.4363 4.8603 6.5802 1.0653 1.0380 1.0964 1.0999 1.0925 1.0926
irintensity: 0.0053 0.2432 0.3918 1.7724 2.2830 2.0706 0.0531 14.4795 5.0254 5.9753 0.3265 1.2497 6.7633 13.0821 3.7022 1.8574 31.9874 1.1707 3.7926 3.6970 23.4716 156.9728 0.7556 25.4773 12.5283 16.6826 14.2274 1.2434 217.3866 216.9329 63.6033 6.4399 236.4632 142.6265 15.9031 31.4025 40.9357 16.7154 68.6404 57.4001 57.1954 80.4257 155.3684 1.3056 7.9332 15.9091 0.9161 9.7542
temp: 298.150 k
press: 1.00000 atm
elementType: 17 8 8 8 7 6 6 6 6 6 6 6 1 1 1 1 1 1
symmnumber: 1
zpe: 318546.2 jmol-1
zpe.correction: 0.121328 hartree
zpe.thermalcorrener: 0.132085 hartree
zpe.thermalcorrenthalpy: 0.133029 hartree
zpe.thermalcorrgfe: 0.084412 hartree
zpe.sumelectzpe: -1009.881715 hartree
zpe.sumelectthermal: -1009.870958 hartree
zpe.sumelectthermalent: -1009.870014 hartree
zpe.sumelectthermalfe: -1009.918631 hartree
dipole: -3.5920 2.2386 0.0046
dipole: 4.2325
quadrupole: -83.7908 -78.4054 -76.2214
quadrupole: -1.3526 -0.0055 0.0121
quadrupole: -4.3183 1.0672 3.2511 -1.3526 -0.0055 0.0121
hfenergy: -1010.003043 hartree
pointgroup: C01 [X(C7H6Cl1N1O3)]
dipole: -1.5406445 -0.6318298 -0.0095962 debye
dipolederiv: -0.4679408 0.2764179 -0.0098883 0.3986046 -0.3932832 0.0108405 -0.0121162 0.0094668 -0.0491683 -0.7635967 0.5166718 -0.0149346 0.3395281 -0.8377111 0.0127646 -0.0117894 0.0159678 -0.3728004 -0.5640726 -0.1759356 -0.0010511 -0.434292 -0.8751658 0.0063769 0.0034393 0.0090179 -0.2138992 -0.9128448 0.1420672 -0.009832 0.3684139 -0.572394 0.0091628 -0.0142148 0.0065771 -0.2762731 1.9257143 0.3452766 0.0138177 0.3711533 1.2069497 -0.0123744 0.0133536 -0.0123395 0.2134117 0.5064542 0.1534882 0.0032652 0.3838521 0.259926 0.0007463 -0.0006403 -0.0019089 0.0569873 -1.0103859 -0.4271263 -0.0046368 -0.1980188 -0.2737194 0.0023875 -0.0086727 -0.0002623 -0.0074496 -0.4633165 0.3171261 -0.0094873 0.1030628 0.0141677 -0.0017306 -0.005312 0.0006729 -0.1830036 0.8547325 -0.6291047 0.0212272 -0.0569271 0.7045139 -0.0113813 0.0113865 -0.0188795 0.1482729 0.2423313 -0.7608773 0.0177776 -0.9830135 0.3370602 -0.0201373 0.0214353 -0.0175615 -0.1333201 0.2751919 0.3219536 -0.0018389 -0.1453671 -0.2114755 0.0015574 0.0064565 0.0074687 -0.0250359 -0.3411961 -0.049455 -0.0038202 0.0581822 0.1067357 -0.0006093 -0.0054163 -0.001797 0.0286001 0.0662582 -0.0181949 -0.0010311 -0.0342143 -0.0149768 0.0026147 -0.0010183 0.0028392 0.1658655 0.118911 -0.0410705 -0.0000028 0.0210938 0.0893639 0.0017988 -0.0010102 0.000777 0.175288 0.0358364 -0.0029041 0.0512002 -0.0125382 0.0733139 -0.0851823 0.0796742 -0.0495903 -0.0045017 0.0392752 -0.0058118 -0.04981 -0.0173738 0.077698 0.0820642 -0.078105 0.0466362 -0.0122034 0.0827147 0.0378509 -0.0010869 -0.0714369 -0.1256347 0.0031175 0.0006538 0.0045114 0.1160265 0.3759338 -0.0003722 0.000132 -0.0907092 0.4346315 -0.0020158 0.0018961 -0.0015961 0.3732034 unknown
polarizability: 166.6631273|-2.5167438|124.8619088|1.5535567|-1.4692132|44.0998315 unknown
InChI: InChI=1S/C7H6ClNO3/c1-4-2-7(10)6(9(11)12)3-5(4)8/h2-3,10H,1H3
charge 0 multiplicity 1
18 atoms
Cl -2.793468 2.087759 -0.048839
O  1.422903 -2.202067 0.081236
O  2.523872 1.869715 0.020111
O  3.15499 -0.321083 0.064868
N  2.226505 0.621907 0.037623
C  -1.901309 -0.578142 0.008589
C  0.837316 0.200395 0.029524
C  -0.878168 -1.544852 0.038535
C  0.495949 -1.193207 0.050256
C  -1.507019 0.797942 -0.010654
C  -0.172797 1.196724 -0.001769
C  -3.355502 -0.986818 -0.003559
H  -1.124442 -2.610125 0.053063
H  0.120977 2.248734 -0.017091
H  -3.891104 -0.567169 0.867649
H  -3.868263 -0.596459 -0.901675
H  -3.46182 -2.08271 0.013265
H  2.347279 -1.762844 0.082868
