program: Gaussian 09
title: 000259617
version: EM64L-G09RevD.01
frameworkgroup: C1[X(C22H22FNO)]
method: RPBEPBE
basis: SDD
operation: Freq
keyword: #p
keyword: freq=noraman
keyword: PBEPBE/SDD
title: #p freq=noraman PBEPBE/SDD
converged: YES YES NO NO
title: Mulliken charges:
elementType: F O N C C C C C C C C C C C C C C C C C C C C C C H H H H H H H H H H H H H H H H H H H H H H
charge: -0.185410 -0.459271 -0.077134 -0.120714 0.227891 0.114649 0.364606 0.395144 -0.491590 -0.372591 0.227547 -0.354265 -0.378154 -0.418744 -0.404997 -0.237789 -0.406048 -0.251638 -0.225662 -0.227996 -0.248705 -0.634995 -0.624124 -0.243106 -0.246908 0.271052 0.224065 0.270037 0.254150 0.270647 0.249418 0.259833 0.355357 0.234820 0.255935 0.227604 0.223784 0.225161 0.226631 0.200443 0.218281 0.216788 0.220262 0.189213 0.230812 0.228485 0.227223
chargesum: 0.00000
title: Mulliken charges with hydrogens summed into heavy atoms:
elementType: F O N C C C C C C C C C C C C C C C C C C C C C C
charge: -0.185410 -0.103913 -0.077134 -0.120714 0.227891 0.114649 0.364606 0.395144 0.003528 -0.102553 0.227547 -0.100115 -0.107507 -0.169326 -0.145164 -0.002969 -0.150113 -0.024034 -0.001878 -0.002835 -0.022074 0.000516 0.016162 -0.014621 -0.019684
polarizability: 2.62536811e+02 1.43328120e+01 2.45013657e+02 -9.87374422e+00 4.18314876e+00 2.14305315e+02
1716.lowfreq: -5.3186 0.0002 0.0004 0.0006 6.9647 8.4746 23.5676 36.6558 49.9610
frequency: 23.3470 36.5810 49.9083 53.1756 62.1203 66.9111 71.4294 93.3495 100.5785 166.6321 180.8049 209.2737 218.2855 225.2096 247.7618 258.4356 264.5121 273.6157 284.1867 291.2288 308.9199 320.1736 340.6476 368.6590 373.6762 402.1889 404.7649 429.5899 448.6547 470.4350 490.6584 528.1475 534.1201 542.2028 614.1418 616.0190 618.8044 620.7959 638.2358 669.9832 704.0046 707.5278 727.0564 749.6308 760.2778 789.6555 796.0963 817.2696 843.3074 855.2195 860.0873 877.8800 904.9352 912.0837 928.9614 942.1565 960.8883 974.8574 981.4219 984.1092 990.0946 990.3183 996.4552 997.1376 1007.3006 1021.9344 1028.2546 1030.4207 1039.3361 1075.7141 1082.3216 1091.8801 1093.4009 1133.2337 1147.4364 1169.7893 1170.1407 1172.1536 1172.5991 1178.4914 1184.2093 1190.9907 1193.2368 1223.6611 1231.2071 1256.8759 1288.2296 1293.6458 1313.3115 1322.1944 1358.1607 1376.4120 1378.8706 1381.5806 1416.5075 1430.4650 1435.4715 1436.1846 1442.2432 1454.0159 1459.1291 1461.7946 1474.7913 1476.6059 1479.0082 1480.8828 1491.7365 1575.2535 1589.4268 1591.1800 1606.7544 1608.8655 1611.9129 2848.7455 2865.8224 2961.3047 3006.9270 3014.4452 3023.6641 3062.8319 3075.0450 3121.2060 3123.6022 3130.0363 3132.4137 3142.3882 3145.4480 3146.1377 3157.4974 3158.1571 3169.0651 3170.3328 3171.0709 3180.4653 3568.4123
redmass: 4.3910 4.0280 3.7865 3.7903 4.3936 4.7104 4.5371 3.7773 4.0343 4.8834 4.8549 4.4350 1.2751 4.6905 3.8511 3.0518 4.5747 1.6237 5.0522 2.3038 1.3188 2.9020 2.7443 3.6260 2.8951 2.8364 2.8142 2.5516 4.0330 4.3407 4.0773 3.7016 5.2463 4.7491 6.2989 6.4283 6.0621 5.0549 5.8832 5.8901 1.8580 1.7061 2.9293 2.6943 1.9021 1.8427 2.3470 4.5466 5.2319 1.2556 1.2485 2.5984 1.6235 2.0086 1.6097 1.7571 4.3652 1.3429 1.4199 1.4129 4.7480 5.7346 1.3417 1.3244 2.8946 2.3772 2.2392 2.1647 1.5220 2.0313 1.5970 1.2535 1.6261 1.4065 2.1191 1.6605 1.6238 1.1254 1.1161 2.3554 2.3836 1.3358 1.1724 2.7515 1.7369 2.4560 1.7158 1.7287 1.3747 1.3465 1.9885 4.5808 8.0749 3.0734 1.1406 2.2156 2.1069 2.0625 1.4329 2.2555 1.0569 1.1525 1.0970 2.0773 1.1543 1.9049 1.0522 6.5100 6.1728 6.2558 6.1356 6.8939 6.3086 1.0564 1.0550 1.0610 1.0759 1.0721 1.0982 1.0992 1.1007 1.0848 1.0845 1.0880 1.0881 1.0935 1.0893 1.0913 1.0973 1.0960 1.0981 1.0919 1.0978 1.0984 1.0661
irintensity: 0.0570 0.2119 0.0828 0.8690 0.7482 0.3272 0.2583 0.3428 1.8355 0.6820 0.2405 0.3443 0.2631 3.4089 16.0504 19.0453 4.0896 54.1426 18.1866 31.6767 65.4577 18.6503 19.7873 2.7676 10.0296 1.2197 1.3701 1.1451 4.1574 0.9777 5.3787 0.6849 3.5695 1.1873 1.2427 0.2029 2.0515 13.6751 15.6351 19.1060 35.3816 65.1490 23.1766 52.4056 60.1169 50.8366 8.0425 14.9175 14.8820 1.4868 0.0542 14.1020 4.4111 16.3991 10.1804 1.2010 34.3739 0.2596 0.1436 0.0370 1.7548 0.4893 1.4581 0.3499 23.6147 49.1662 10.0649 9.6464 12.3723 8.4111 0.1842 6.4193 6.4786 5.2539 30.6517 4.6010 2.2168 1.2756 0.4212 5.0866 25.6990 3.6924 0.5246 42.2001 2.8304 3.8447 21.0447 36.7393 2.6957 13.2151 5.5530 0.9236 1.4623 8.0624 3.4142 8.7390 21.6818 30.4904 27.6722 16.9531 21.6463 0.7495 15.6574 20.3907 3.2331 16.6995 18.8083 18.2475 0.2338 0.9609 9.6592 14.2339 0.6855 103.8307 122.2396 54.4472 37.3467 50.2788 7.7474 49.6268 43.5650 2.3283 1.0889 4.2255 7.6335 28.6101 9.6269 23.7609 22.3050 27.8638 15.7715 4.7053 10.8670 11.0006 15.0939
temp: 298.150 k
press: 1.00000 atm
elementType: 9 8 7 6 6 6 6 6 6 6 6 6 6 6 6 6 6 6 6 6 6 6 6 6 6 1 1 1 1 1 1 1 1 1 1 1 1 1 1 1 1 1 1 1 1 1 1
symmnumber: 1
zpe: 995734.7 jmol-1
zpe.correction: 0.379255 hartree
zpe.thermalcorrener: 0.402094 hartree
zpe.thermalcorrenthalpy: 0.403038 hartree
zpe.thermalcorrgfe: 0.326789 hartree
zpe.sumelectzpe: -1079.535709 hartree
zpe.sumelectthermal: -1079.512871 hartree
zpe.sumelectthermalent: -1079.511927 hartree
zpe.sumelectthermalfe: -1079.588175 hartree
dipole: -1.8062 -0.7256 0.0649
dipole: 1.9476
quadrupole: -149.9082 -136.3585 -136.6765
quadrupole: 6.3545 3.3797 -1.2569
quadrupole: -8.9271 4.6226 4.3045 6.3545 3.3797 -1.2569
hfenergy: -1079.9149646 hartree
pointgroup: C01 [X(C22H22F1N1O1)]
dipole: 0.717565 0.2687138 0.0014383 debye
polarizability: 263.4189192|14.3938576|243.6416662|8.3852047|-6.4078233|214.7951978 unknown
InChI: InChI=1S/C22H22FNO/c1-24(2)16-19-20(14-9-15-21(19)23)22(25,17-10-5-3-6-11-17)18-12-7-4-8-13-18/h3-15,25H,16H2,1-2H3
charge 0 multiplicity 1
47 atoms
F  -3.907279 1.252009 -1.346872
O  0.154938 -0.136135 1.89139
N  -3.529503 -0.104096 1.236681
C  0.598088 -0.022178 0.472234
C  -0.366593 0.948652 -0.262551
C  -1.769349 0.657918 -0.360331
C  2.078247 0.45462 0.443925
C  0.560009 -1.459927 -0.091993
C  -2.478645 -0.536482 0.274361
C  0.13402 2.149539 -0.831308
C  -2.552697 1.562506 -1.115396
C  2.836239 0.401262 -0.755043
C  0.897904 -2.543895 0.756718
C  2.705509 0.930904 1.619245
C  0.282522 -1.714368 -1.456887
C  -0.704867 3.048697 -1.52339
C  -2.071229 2.748844 -1.69097
C  4.180008 0.830377 -0.780682
C  0.940885 -3.860252 0.250294
C  4.053371 1.360195 1.596879
C  0.330441 -3.032614 -1.964922
C  -3.006802 0.531786 2.458305
C  -4.491558 -1.182591 1.525947
C  4.796113 1.316615 0.396716
C  0.659469 -4.11133 -1.113763
H  -1.741579 -1.218017 0.745853
H  -2.992063 -1.104331 -0.525354
H  1.196716 2.383848 -0.736308
H  2.379981 0.012271 -1.671535
H  1.108426 -2.346954 1.811901
H  2.147976 0.934762 2.560215
H  0.010622 -0.886904 -2.122353
H  -0.175855 0.751342 2.181638
H  -0.290577 3.970315 -1.944589
H  -2.750584 3.398184 -2.250574
H  4.747409 0.778963 -1.716808
H  1.19643 -4.690767 0.918288
H  4.521824 1.721805 2.519417
H  0.107229 -3.215001 -3.022301
H  -2.373552 -0.146789 3.083563
H  -3.85524 0.879039 3.075224
H  -2.409369 1.423204 2.189389
H  -5.302999 -0.790063 2.165335
H  -4.03901 -2.063817 2.04911
H  -4.94393 -1.538478 0.583022
H  5.84085 1.646562 0.379216
H  0.694955 -5.133831 -1.506241
