program: Gaussian 09
title: 000259581
version: EM64L-G09RevD.01
frameworkgroup: C1[X(C9H9N3O6)]
method: RPBEPBE
basis: SDD
operation: Freq
keyword: #pfreq=noraman
keyword: PBEPBE/SDD
title: #p freq=noraman PBEPBE/SDD
converged: YES YES NO NO
title: Mulliken charges:
elementType: O O O O O O N N N C C C C C C C C C H H H H H H H H H
charge: -0.415165 -0.194441 -0.185279 -0.257333 -0.211541 -0.203868 -0.381079 0.026079 0.016933 -0.159106 0.354393 0.247315 -0.280148 -0.720608 -0.500114 0.448121 -0.416887 0.178692 0.268441 0.365364 0.261044 0.252437 0.247716 0.238616 0.336882 0.293259 0.390278
chargesum: 0.00000
title: Mulliken charges with hydrogens summed into heavy atoms:
elementType: O O O O O O N N N C C C C C C C C C
charge: -0.024888 -0.194441 -0.185279 -0.257333 -0.211541 -0.203868 -0.015715 0.026079 0.016933 0.109335 0.354393 0.247315 -0.019104 0.018161 -0.163232 0.448121 -0.123629 0.178692
polarizability: 2.28629057e+02 1.01630815e+01 1.78203264e+02 -1.38093679e+01 9.96939888e+00 7.86319463e+01
1716.lowfreq: -5.6951 -1.7739 0.0004 0.0005 0.0007 3.8428 19.8341 36.3456 42.5960
frequency: 19.8278 36.3327 42.5930 57.9928 75.4544 95.5708 122.3976 165.5210 166.6276 203.4943 224.8605 268.5242 272.6633 286.9583 321.4614 340.7174 374.6614 419.2043 439.8744 483.4416 506.9638 517.7774 589.5505 602.7142 624.4146 650.8259 655.4111 675.5900 702.8037 706.7790 728.2627 754.7574 774.0457 784.3396 804.5347 834.4898 883.4069 955.9393 967.9246 995.3056 1028.4057 1047.7030 1054.0771 1086.8760 1108.5274 1140.2962 1166.9723 1184.8158 1219.4208 1244.3578 1253.4447 1290.0195 1315.1404 1343.9753 1346.9488 1363.8953 1383.7980 1397.3852 1451.6720 1474.5979 1479.3977 1490.1017 1527.2398 1585.2676 1629.7026 1678.4657 3001.3711 3012.7849 3101.9997 3119.4860 3165.4618 3186.8699 3188.4516 3314.3893 3517.6042
redmass: 9.0937 6.6145 8.3773 14.4353 10.6013 6.1164 5.7176 5.3406 10.3120 4.1194 1.1172 5.9472 4.1253 5.2095 8.8090 5.9657 11.8116 6.1876 3.9365 4.8109 7.4225 3.6254 3.0028 1.5809 6.0255 6.2710 6.1744 8.3072 4.0799 7.5581 3.3322 11.4306 2.0797 1.5850 4.3325 1.5184 6.5006 2.0196 1.4119 1.3322 3.0152 2.1172 1.7685 2.7115 3.8116 1.6960 4.1859 2.5217 6.3177 1.5370 1.6611 1.4393 2.3590 1.6214 3.6807 5.2139 4.6811 1.2360 5.0636 1.0681 1.1373 2.2287 3.6656 4.2288 7.2029 9.0299 1.0365 1.0836 1.1014 1.1003 1.0885 1.0949 1.0938 1.0794 1.0644
irintensity: 0.8887 0.5647 0.4059 0.0859 0.9414 1.0369 1.4343 2.8483 4.7194 1.4735 0.1886 1.5333 0.5414 0.1325 0.1752 0.3127 0.7631 1.9288 0.3503 48.1373 1.3697 17.8408 46.9226 80.8542 4.7912 31.4042 28.2600 18.1811 23.8011 11.7491 0.6027 14.2247 44.9165 48.8983 4.0010 23.7920 7.9309 3.6847 24.2130 0.2670 340.7518 14.0669 17.4647 20.3008 40.8327 7.8340 285.8806 281.8727 277.9483 15.0032 31.3748 11.8863 112.9204 9.5959 163.9101 57.3048 57.7556 19.5545 3.7929 15.2794 9.5198 41.1713 110.2451 132.3726 365.8722 179.7664 11.4147 10.8762 14.4840 12.7104 4.2061 3.7613 21.0668 107.5407 38.1942
temp: 298.150 k
press: 1.00000 atm
elementType: 8 8 8 8 8 8 7 7 7 6 6 6 6 6 6 6 6 6 1 1 1 1 1 1 1 1 1
symmnumber: 1
zpe: 490677.9 jmol-1
zpe.correction: 0.186889 hartree
zpe.thermalcorrener: 0.203483 hartree
zpe.thermalcorrenthalpy: 0.204427 hartree
zpe.thermalcorrgfe: 0.140230 hartree
zpe.sumelectzpe: -962.486458 hartree
zpe.sumelectthermal: -962.469864 hartree
zpe.sumelectthermalent: -962.468919 hartree
zpe.sumelectthermalfe: -962.533117 hartree
dipole: 8.1245 -3.1324 -2.3917
dipole: 9.0299
quadrupole: -113.3328 -113.6924 -105.1173
quadrupole: -9.7555 -2.1537 -3.9959
quadrupole: -2.6186 -2.9782 5.5969 -9.7555 -2.1537 -3.9959
hfenergy: -962.6733469 hartree
pointgroup: C01 [X(C9H9N3O6)]
dipole: 2.9091476 1.9355107 0.6417681 debye
polarizability: 217.6233968|12.9157518|161.1197779|41.5888245|-35.3240166|106.7210925 unknown
InChI: InChI=1S/C9H9N3O6/c1-5(9(13)14)10-7-3-2-6(11(15)16)4-8(7)12(17)18/h2-5,10,13H,1H3
charge 0 multiplicity 1
27 atoms
O  3.662168 2.457383 -0.79332
O  3.067662 0.332063 -1.54102
O  -1.356589 -3.083632 1.146802
O  0.758999 -2.382491 1.601186
O  -4.007868 1.773508 -1.793052
O  -4.563035 -0.336184 -1.110383
N  1.5226 0.019228 0.889565
N  -0.437331 -2.185016 1.097395
N  -3.728717 0.643463 -1.226118
C  2.577901 1.027367 0.808561
C  0.262127 0.158938 0.373003
C  -0.728802 -0.89608 0.462974
C  -0.150674 1.374089 -0.27708
C  3.756449 0.622596 1.727316
C  -2.027988 -0.735916 -0.061238
C  -2.372099 0.47173 -0.67939
C  -1.43439 1.533743 -0.790981
C  3.097379 1.185446 -0.636268
H  2.199828 2.014763 1.133694
H  1.721614 -0.909934 1.298761
H  0.562403 2.196201 -0.377688
H  4.551772 1.383322 1.680086
H  3.407775 0.54331 2.77106
H  4.179076 -0.349715 1.418126
H  -2.752048 -1.550735 0.019179
H  -1.740116 2.460063 -1.284426
H  4.051104 2.54799 -1.705442
