program: Gaussian 09
title: 000259598
version: EM64L-G09RevD.01
frameworkgroup: C1[X(C15H18N2O7)]
method: RPBEPBE
basis: SDD
operation: Freq
keyword: #p
keyword: freq=noraman
keyword: PBEPBE/SDD
title: #p freq=noraman PBEPBE/SDD
converged: YES YES NO NO
title: Mulliken charges:
elementType: O O O O O O O N N C C C C C C C C C C C C C C C H H H H H H H H H H H H H H H H H H
charge: -0.415798 -0.218473 -0.279695 -0.267965 -0.407839 -0.247510 -0.347092 -0.394453 -0.361273 -0.134211 -0.434996 -0.497353 0.178616 0.249336 -0.532902 0.198557 0.462064 -0.481025 0.355091 -0.386316 -0.379270 -0.231036 -0.223967 -0.240259 0.305250 0.265797 0.243673 0.266507 0.270334 0.371661 0.264756 0.256489 0.338194 0.244985 0.226172 0.381177 0.251722 0.233903 0.379859 0.279093 0.227424 0.230771
chargesum: 0.00000
title: Mulliken charges with hydrogens summed into heavy atoms:
elementType: O O O O O O O N N C C C C C C C C C C C C C C C
charge: -0.034621 -0.218473 -0.279695 -0.267965 -0.027980 -0.247510 -0.347092 -0.022793 -0.023079 0.171039 0.074474 0.039488 0.178616 0.249336 -0.011657 0.198557 0.462064 -0.009868 0.355091 -0.134594 -0.145366 0.048057 0.003457 -0.009488
polarizability: 2.13750674e+02 8.42640884e-01 2.01834809e+02 1.39930162e+01 9.18862815e+00 1.61075955e+02
1716.lowfreq: -2.6277 0.0001 0.0005 0.0008 6.3077 9.9036 20.5002 26.1236 28.9300
frequency: 17.8213 25.9134 28.9263 37.2311 44.9036 56.3505 59.1604 67.2593 73.5732 87.0040 90.4027 92.6454 126.0563 154.4656 167.5691 177.8306 199.9655 213.7360 259.8900 268.4759 299.1961 315.9663 351.8095 388.3969 406.9010 415.2969 425.1424 461.5297 485.3540 515.6848 524.7637 548.7647 571.7948 579.5722 595.1758 616.1356 618.5541 626.6060 641.4793 660.6627 695.6586 707.6729 710.0153 743.5205 763.6074 766.9333 774.5999 817.9576 819.3414 833.4285 867.8826 880.3613 902.7132 937.6553 940.3958 951.9559 972.3248 985.1355 990.7423 993.4699 1015.4208 1022.2802 1025.8191 1035.5747 1075.8778 1091.4719 1101.6018 1102.7227 1146.3731 1174.8930 1189.1974 1210.1351 1218.9074 1224.0019 1226.6278 1235.3734 1254.6316 1256.8845 1269.0454 1283.9877 1303.7746 1328.7435 1336.7617 1337.3690 1345.7307 1362.5104 1386.8513 1388.4040 1440.9043 1443.1459 1443.4028 1462.8472 1467.8320 1484.7886 1489.2369 1533.8394 1595.0138 1609.6316 1613.7230 1642.0256 1656.9715 1676.0582 2988.7658 3014.2387 3019.7805 3033.5045 3042.8521 3065.2737 3090.0643 3116.1944 3116.3632 3119.5060 3132.8773 3143.3878 3153.7886 3171.5399 3336.2109 3506.6482 3519.0886 3573.9214
redmass: 6.3848 8.1764 7.2917 6.8526 6.6239 6.2214 4.9634 7.7329 4.8001 6.0185 5.3993 4.0542 6.4530 5.8689 5.0848 5.2191 7.6974 4.0514 3.5905 6.2178 5.0645 4.3642 2.7437 3.3425 2.8483 4.9460 3.9243 4.0636 3.5742 2.9927 2.3870 1.2639 2.1356 3.3591 4.0249 4.1162 5.1662 2.4325 4.0290 1.4256 5.8681 1.8872 4.2697 3.8028 1.3643 1.8687 1.7528 3.4902 3.1896 3.9209 1.2420 5.1543 4.4151 1.5493 3.0997 3.4929 1.8445 1.3746 6.0449 2.7092 1.3228 2.4338 2.1853 2.9033 2.1146 1.5174 2.6528 4.7603 2.2277 1.0576 1.1134 1.6121 1.7151 2.7816 1.4657 1.1727 1.6779 1.5347 1.7497 1.4531 1.3992 1.2723 1.4011 1.3956 1.2436 1.5410 7.2897 1.7415 1.1026 1.7378 1.2610 1.1397 1.0878 2.2112 1.9079 1.7919 6.1124 8.5285 6.1820 5.0837 8.1141 8.6611 1.0663 1.0648 1.0643 1.0800 1.0585 1.0946 1.1022 1.1061 1.0994 1.0890 1.0893 1.0904 1.0969 1.1000 1.0842 1.0639 1.0642 1.0780
irintensity: 0.0904 0.7044 0.9012 0.8691 0.7954 0.7523 0.1081 0.7854 4.4905 1.4280 4.3405 4.5102 11.6273 3.8519 0.9346 3.2764 7.7648 3.2055 0.6567 9.4959 3.3679 3.7295 9.6027 9.1826 0.0212 25.6621 12.0566 2.6470 45.4348 25.0330 25.4478 97.4301 118.2951 47.4963 20.9919 2.1618 0.1323 18.9241 18.9350 118.7675 32.0936 65.8371 13.9265 38.5115 71.5208 36.1501 83.9165 8.4537 10.1731 9.8291 0.6528 22.0869 111.2540 2.0782 17.5851 4.9278 15.4366 0.1165 2.3510 31.8352 0.3535 108.8903 5.8280 248.1546 225.2094 4.5832 15.0099 95.9579 12.5977 1.1477 0.6763 97.0582 89.3095 23.7425 6.8067 7.7596 87.2745 13.0984 33.4543 24.2519 9.9624 1.7708 37.4057 7.1718 11.7498 28.2141 5.5915 42.9025 24.6696 12.4293 27.3356 12.1105 22.8510 43.6880 248.5297 335.0158 4.1791 65.1950 2.9078 336.3191 258.9375 175.8632 3.8512 15.8202 3.7953 8.7879 34.6615 1.5318 17.1833 3.1610 5.8851 5.6862 17.0937 7.8970 28.5050 8.2132 267.2426 29.3324 29.3168 50.2224
temp: 298.150 k
press: 1.00000 atm
elementType: 8 8 8 8 8 8 8 7 7 6 6 6 6 6 6 6 6 6 6 6 6 6 6 6 1 1 1 1 1 1 1 1 1 1 1 1 1 1 1 1 1 1
symmnumber: 1
zpe: 849394.9 jmol-1
zpe.correction: 0.323517 hartree
zpe.thermalcorrener: 0.347419 hartree
zpe.thermalcorrenthalpy: 0.348363 hartree
zpe.thermalcorrgfe: 0.265929 hartree
zpe.sumelectzpe: -1216.725566 hartree
zpe.sumelectthermal: -1216.701665 hartree
zpe.sumelectthermalent: -1216.700720 hartree
zpe.sumelectthermalfe: -1216.783155 hartree
dipole: 2.7960 1.3979 -0.5654
dipole: 3.1767
quadrupole: -135.5541 -126.2161 -142.4559
quadrupole: -17.1631 0.8935 2.3056
quadrupole: -0.8121 8.5259 -7.7139 -17.1631 0.8935 2.3056
hfenergy: -1217.0490839 hartree
pointgroup: C01 [X(C15H18N2O7)]
dipole: -1.0062384 0.7276635 0.141606 debye
polarizability: 216.2407044|-1.4933259|190.9946647|5.7521382|-21.4378595|169.4260687 unknown
InChI: InChI=1S/C15H18N2O7/c18-12(17-11(14(21)22)6-7-13(19)20)8-16-15(23)24-9-10-4-2-1-3-5-10/h1-5,11,16-17,19,21H,6-9H2
charge 0 multiplicity 1
42 atoms
O  4.440399 -0.398981 -2.106088
O  4.438547 -0.753122 0.192123
O  -2.391882 -1.663733 1.919203
O  2.271763 -3.446408 -0.575543
O  2.041384 4.121004 0.338017
O  0.29703 3.309893 -0.954086
O  -0.284217 -0.605681 2.046481
N  1.62228 -1.29835 0.056794
N  -0.513132 -2.875742 1.513096
C  2.282047 -0.650465 -1.072071
C  1.736083 0.785317 -1.295112
C  2.045417 1.758114 -0.133522
C  3.809341 -0.629325 -0.876026
C  1.667081 -2.665378 0.219651
C  0.929404 -3.174409 1.482087
C  1.356391 3.094902 -0.321813
C  -3.350593 0.315246 0.73331
C  -3.074521 -0.324021 2.074923
C  -1.001578 -1.635029 1.837673
C  -2.43291 1.243466 0.177356
C  -4.528516 -0.007882 0.011455
C  -2.680867 1.835928 -1.08123
C  -4.780667 0.582232 -1.246559
C  -3.856959 1.504401 -1.793926
H  2.099893 -1.245382 -1.985858
H  0.643471 0.721746 -1.445718
H  2.172772 1.177665 -2.230138
H  1.688811 1.353945 0.836113
H  3.128466 1.929212 -0.010361
H  1.122857 -0.744579 0.771573
H  1.407669 -2.730819 2.375416
H  1.062464 -4.266191 1.515844
H  -1.187766 -3.603105 1.273957
H  -2.430546 0.306511 2.710645
H  -3.999322 -0.594729 2.607535
H  5.427231 -0.391406 -1.976894
H  -1.521876 1.496437 0.73138
H  -5.244784 -0.722617 0.435586
H  1.541071 4.975885 0.229669
H  -1.954911 2.546503 -1.488685
H  -5.693875 0.328653 -1.796606
H  -4.054851 1.963595 -2.769251
