program: Gaussian 09
title: 000259565
version: EM64L-G09RevD.01
frameworkgroup: C1[X(C17H17ClO2)]
method: RPBEPBE
basis: SDD
operation: Freq
keyword: #p
keyword: freq=noraman
keyword: PBEPBE/SDD
title: #p freq=noraman PBEPBE/SDD
converged: YES YES NO NO
title: Mulliken charges:
elementType: Cl O O C C C C C C C C C C C C C C C C C H H H H H H H H H H H H H H H H H
charge: -0.095902 -0.412628 -0.409652 0.187247 0.268165 0.287878 -0.416472 0.102038 -0.378668 0.486411 0.105177 -0.555355 -0.813139 -0.388000 -0.375561 0.474341 -0.540806 -0.396044 -0.809583 -0.805619 0.283139 0.255737 0.255325 0.305536 0.312449 0.230937 0.234609 0.259854 0.234822 0.227612 0.230527 0.232175 0.230891 0.231912 0.234311 0.364285 0.362052
chargesum: 0.00000
title: Mulliken charges with hydrogens summed into heavy atoms:
elementType: Cl O O C C C C C C C C C C C C C C C C C
charge: -0.095902 -0.048343 -0.047600 0.187247 0.268165 0.287878 -0.133333 0.102038 -0.122931 0.486411 0.105177 -0.300030 -0.195154 -0.157064 -0.140952 0.474341 -0.280952 -0.161222 -0.119269 -0.108504
polarizability: 3.55385707e+02 -2.29434326e+01 2.14890717e+02 5.66715728e+00 -9.07547764e+00 1.09208900e+02
1716.lowfreq: -25.3676 -0.0021 0.0012 0.0015 3.6050 5.0588 10.6977 27.8109 30.0433
frequency: -25.0892 27.7798 30.0307 39.2446 47.7363 63.4931 90.4354 114.9207 145.8066 165.3997 178.4965 207.2987 213.7934 219.2315 247.5204 292.0807 299.6362 306.5424 357.5607 383.1801 431.3527 443.9070 457.2657 462.8086 492.0379 498.0422 507.4672 540.1752 555.6549 572.9077 583.7097 592.2064 610.1683 681.1873 712.9131 717.0257 726.9535 738.8612 748.4742 789.6787 815.5929 822.2243 884.6137 892.3009 930.9903 934.4890 940.7500 947.1298 959.2221 962.5264 1002.7279 1006.1060 1015.4539 1046.2206 1046.5329 1103.1980 1116.8803 1133.6812 1145.6357 1148.0448 1179.4872 1189.5139 1222.0133 1233.4107 1236.9542 1247.8399 1291.2701 1296.2934 1298.5242 1354.1503 1368.9834 1394.4418 1397.9265 1398.4183 1425.3466 1434.8620 1464.9721 1469.1003 1470.0175 1473.6991 1475.2292 1490.1850 1498.3900 1557.8797 1567.5012 1599.6475 1630.1558 1634.4541 2978.4090 2979.1571 3056.4652 3056.7280 3074.8175 3075.5729 3088.1060 3092.0025 3113.9905 3130.4980 3144.9200 3152.8295 3156.9478 3161.6940 3164.5624 3444.9884 3498.5477
redmass: 1.0456 5.7586 5.4672 1.1233 3.1923 5.4035 4.2438 10.4486 6.4401 4.8712 6.8774 5.0379 4.8356 4.4700 2.9366 3.2101 3.2659 3.8050 3.3707 3.8688 3.7847 4.5650 2.9712 2.5646 1.8712 3.4747 2.5650 5.5781 5.3862 3.1656 3.9003 3.4505 1.4662 4.5621 4.7435 6.1946 3.9640 4.0514 3.3568 3.3451 1.4173 1.3281 1.4293 1.4265 2.6380 1.8294 1.6865 2.2535 1.3749 1.3699 1.5279 1.5664 3.4118 1.5525 1.5633 1.7584 1.2741 1.6071 1.4138 1.4532 2.1151 1.5387 1.7726 1.6293 1.3712 2.3794 2.0317 1.8757 1.7033 2.6298 4.3033 2.6455 1.2319 1.3309 3.0003 2.7797 1.1433 1.0486 1.0470 1.2110 1.2041 2.5406 3.0809 6.2886 5.9126 6.8796 6.3693 6.6232 1.0374 1.0376 1.0974 1.0972 1.0648 1.0794 1.0988 1.0988 1.0877 1.0887 1.0960 1.0920 1.0923 1.0956 1.1124 1.0674 1.0646
irintensity: 0.5604 0.2594 1.7275 0.2417 0.6901 0.3212 0.6386 3.1256 0.7945 4.9875 3.5532 7.3477 0.0423 0.2086 2.1198 4.5968 2.2012 1.5972 8.1686 9.7175 5.4525 13.1692 7.3984 27.2085 68.6910 18.6795 47.5738 13.5659 11.0315 12.6672 3.6451 15.1996 99.4152 25.9577 7.5025 0.3069 1.4282 11.6588 13.0403 14.5958 45.0285 34.3310 8.7144 8.7349 18.3724 14.4676 4.1505 33.3294 5.6856 2.1249 24.2204 30.3563 14.8104 12.1451 15.8619 1.4000 48.1102 72.1926 25.5167 62.6167 3.9532 43.3459 6.3067 16.0550 66.1196 3.6754 59.9916 0.0854 0.8782 79.0388 4.6854 6.8882 11.0199 10.2854 5.0571 4.4302 17.2265 15.5041 13.7053 3.1542 58.8711 15.2559 20.7768 26.7251 37.9827 56.2831 78.5948 104.7775 42.1926 30.4400 19.0513 18.8955 12.3441 9.9477 19.1856 18.9659 8.5939 13.4649 20.4714 7.9465 6.0745 7.0191 2.7247 182.8470 60.1699
temp: 298.150 k
press: 1.00000 atm
elementType: 17 8 8 6 6 6 6 6 6 6 6 6 6 6 6 6 6 6 6 6 1 1 1 1 1 1 1 1 1 1 1 1 1 1 1 1 1
symmnumber: 1
zpe: 764522.7 jmol-1
zpe.correction: 0.291191 hartree
zpe.thermalcorrener: 0.310199 hartree
zpe.thermalcorrenthalpy: 0.311143 hartree
zpe.thermalcorrgfe: 0.242170 hartree
zpe.sumelectzpe: -1267.074523 hartree
zpe.sumelectthermal: -1267.055515 hartree
zpe.sumelectthermalent: -1267.054571 hartree
zpe.sumelectthermalfe: -1267.123545 hartree
dipole: 0.5686 -1.8048 0.4561
dipole: 1.9464
quadrupole: -103.8987 -131.1436 -126.8808
quadrupole: -8.4859 4.0364 1.2864
quadrupole: 16.7423 -10.5026 -6.2398 -8.4859 4.0364 1.2864
hfenergy: -1267.3657145 hartree
pointgroup: C01 [X(C17H17Cl1O2)]
dipole: 0.1993264 -0.7393593 0.0064686 debye
polarizability: 353.6410322|-28.423404|214.7908169|2.6782065|16.2063936|111.0534742 unknown
InChI: InChI=1S/C17H17ClO2/c1-11-3-5-13(16(19)7-11)9-14(10-18)15-6-4-12(2)8-17(15)20/h3-9,19-20H,10H2,1-2H3
charge 0 multiplicity 1
37 atoms
Cl -0.238686 3.308735 1.092084
O  -1.73859 -2.147427 0.469221
O  2.505974 2.180381 0.110232
C  -1.970463 0.303722 0.112661
C  -0.512999 0.534243 0.397769
C  1.906877 -0.227973 -0.283749
C  0.433877 -0.143581 -0.3528
C  -2.512918 -1.017589 0.144849
C  -2.869087 1.368046 -0.166709
C  -4.756695 -0.190087 -0.415259
C  2.835866 0.834829 -0.037968
C  -3.880289 -1.256541 -0.11747
C  -0.171826 1.400071 1.566086
C  -4.232082 1.13116 -0.429571
C  2.471053 -1.516298 -0.55572
C  4.755771 -0.713417 -0.192024
C  4.229095 0.575052 0.020267
C  3.847753 -1.768114 -0.497452
C  -6.224741 -0.445412 -0.707682
C  6.249705 -0.969562 -0.12986
H  0.013116 -0.802374 -1.129009
H  -2.481345 2.391061 -0.191026
H  -4.241362 -2.289115 -0.07172
H  -0.917447 1.349649 2.370038
H  0.852614 1.282073 1.945294
H  -4.894734 1.975182 -0.653507
H  1.78495 -2.338424 -0.796446
H  4.887809 1.427788 0.213936
H  4.229037 -2.776733 -0.692467
H  -6.478488 -1.514921 -0.614658
H  -6.874734 0.119484 -0.013524
H  -6.488779 -0.123421 -1.732719
H  6.807496 -0.059537 0.147261
H  6.488781 -1.754974 0.611385
H  6.634702 -1.319118 -1.106537
H  -0.818707 -1.862267 0.714281
H  1.540299 2.40171 0.010109
