program: Gaussian 09
title: 000259574
version: EM64L-G09RevD.01
frameworkgroup: C1[X(C19H18N2O3)]
method: RPBEPBE
basis: SDD
operation: Freq
keyword: #p
keyword: freq=noraman
keyword: PBEPBE/SDD
title: #p freq=noraman PBEPBE/SDD
converged: YES YES NO NO
title: Mulliken charges:
elementType: O O O N N C C C C C C C C C C C C C C C C C C C H H H H H H H H H H H H H H H H H H
charge: -0.283846 -0.253025 -0.310382 -0.394140 -0.118836 0.155849 0.202056 0.227490 -0.508201 -0.322707 0.361027 -0.321563 -0.368297 -0.028181 -0.407918 0.160824 0.424295 -0.388184 -0.419988 -0.622237 -0.600895 -0.219630 -0.224629 -0.240898 0.309830 0.316022 0.311470 0.233909 0.251309 0.225659 0.227219 0.260267 0.231345 0.225266 0.280905 0.230063 0.210174 0.267941 0.241574 0.225089 0.226231 0.227745
chargesum: 0.00000
title: Mulliken charges with hydrogens summed into heavy atoms:
elementType: O O O N N C C C C C C C C C C C C C C C C C C C
charge: -0.283846 -0.253025 -0.310382 -0.078118 -0.118836 0.155849 0.202056 0.227490 -0.198371 -0.011238 0.361027 -0.087654 -0.116987 -0.028181 0.044959 0.160824 0.424295 -0.127917 -0.188644 0.113997 0.118794 0.005458 0.001601 -0.013153
polarizability: 3.42956731e+02 -6.83899016e+00 2.64396632e+02 -6.80955092e+00 1.47079922e+01 1.21864165e+02
1716.lowfreq: -3.1545 0.0001 0.0006 0.0008 3.3817 5.3577 19.4856 24.4356 35.6973
frequency: 19.2947 24.4145 35.6838 37.3184 45.1668 76.1615 83.8517 106.0299 116.9312 131.7737 138.4674 156.8432 164.7489 210.9593 227.8170 234.9908 270.8446 277.5657 281.2489 348.0708 356.9424 374.2941 401.5910 405.6052 429.5772 434.2863 463.0029 478.4309 496.6530 513.5241 578.7746 585.7931 604.2493 614.5602 617.1723 633.6297 653.9067 693.5802 702.0828 739.3686 745.3614 754.5278 783.5568 800.7123 807.6258 820.8460 841.9107 855.6070 856.5186 888.5357 911.6317 918.5946 938.2513 959.6372 978.6511 982.9652 990.0573 994.5424 1012.4332 1027.9886 1053.6249 1066.3241 1086.1152 1092.0937 1103.3360 1137.2200 1141.5546 1159.7850 1172.0718 1186.8960 1194.5681 1206.7615 1225.7939 1231.1158 1242.3424 1265.6630 1282.7422 1314.3490 1330.0617 1361.1542 1379.3003 1389.9754 1398.4228 1409.3805 1432.9850 1440.4458 1442.8816 1455.9408 1457.9123 1469.3731 1473.6021 1474.9004 1486.9903 1487.5151 1493.7265 1502.5726 1549.3623 1562.2552 1595.9821 1599.2238 1618.8227 1631.0133 2939.7068 2971.2157 2979.9830 3002.1296 3048.6022 3052.5116 3115.2626 3121.7183 3126.8146 3140.7339 3141.0695 3147.9369 3157.5705 3170.3805 3171.8329 3191.9867 3248.9782 3596.2845
redmass: 3.7553 5.2669 5.2715 4.9423 5.1071 3.1566 3.7124 4.9814 1.3703 2.6847 1.3593 4.5618 5.8628 5.6167 3.6376 4.3633 2.9968 4.9800 3.8790 5.7892 5.4856 4.6285 2.8909 5.4362 2.9377 3.0174 3.4534 6.4038 4.6406 6.6818 2.5074 5.3534 5.3028 1.4819 6.1285 6.1186 3.6431 7.7926 2.1450 2.0100 3.4040 4.4058 4.6392 5.2121 1.6178 4.1634 4.7859 1.2540 1.5966 1.4943 1.6107 2.9963 1.3322 3.6082 1.4084 4.1805 5.9797 1.3506 1.7317 2.1430 1.4155 2.5399 1.5770 1.2307 1.5076 1.1941 1.3915 2.2784 1.0534 1.1254 2.4610 1.2530 1.8601 5.1240 1.8022 3.5184 2.1380 1.4638 3.1240 1.8178 3.2937 4.2026 5.0846 1.2086 2.3588 2.0990 1.2998 2.1395 1.1469 1.0714 2.6613 1.6906 2.2413 1.0929 1.2799 4.7004 7.3911 4.8559 6.2049 6.8461 6.0714 7.4471 1.0584 1.0358 1.0378 1.1023 1.1014 1.1020 1.0871 1.0977 1.0870 1.0929 1.0894 1.0958 1.0972 1.0982 1.0958 1.0921 1.0996 1.0810
irintensity: 0.3675 0.6925 0.2715 5.9747 1.3687 2.8195 7.3432 1.3769 0.4390 0.6286 0.4584 2.4541 0.5832 2.3404 5.8620 5.1581 9.2675 2.4606 1.2857 19.4774 6.4432 7.5084 1.8094 7.8596 2.2678 4.3359 4.8741 6.6296 7.6993 1.0661 34.1310 11.8669 18.2689 83.4214 2.0584 7.8539 2.4821 7.9521 32.5913 79.0960 8.9513 5.9871 34.9666 38.5086 51.4786 8.6212 27.3693 0.7246 11.4514 24.9822 13.1916 32.3053 0.1563 43.1225 2.1372 99.4562 0.0101 0.3359 2.3776 8.8602 7.1816 47.0102 8.3821 0.3842 165.1512 2.9525 0.3015 114.5809 0.4471 11.4357 111.1195 9.9352 11.5641 49.6799 21.9625 169.9814 7.0604 9.3801 1.4986 19.2120 67.5712 12.1117 11.1056 34.2509 93.8126 18.7048 0.8654 167.8909 34.7086 14.6340 17.9374 7.2863 10.9982 15.5613 22.0535 14.9667 477.2307 147.1040 1.9981 51.9181 13.2057 80.1101 16.9469 41.4495 111.4065 25.6732 41.9252 23.6405 8.1903 2.2384 0.9340 29.2008 11.3684 7.3876 36.6916 9.8553 8.4283 9.9565 18.7342 81.7597
temp: 298.150 k
press: 1.00000 atm
elementType: 8 8 8 7 7 6 6 6 6 6 6 6 6 6 6 6 6 6 6 6 6 6 6 6 1 1 1 1 1 1 1 1 1 1 1 1 1 1 1 1 1 1
symmnumber: 1
zpe: 864696.9 jmol-1
zpe.correction: 0.329346 hartree
zpe.thermalcorrener: 0.351230 hartree
zpe.thermalcorrenthalpy: 0.352174 hartree
zpe.thermalcorrgfe: 0.275518 hartree
zpe.sumelectzpe: -1068.297593 hartree
zpe.sumelectthermal: -1068.275709 hartree
zpe.sumelectthermalent: -1068.274765 hartree
zpe.sumelectthermalfe: -1068.351421 hartree
dipole: 1.3640 0.8758 2.5788
dipole: 3.0460
quadrupole: -126.5234 -109.6879 -144.1003
quadrupole: 2.3539 9.8051 2.2021
quadrupole: 0.2471 17.0827 -17.3298 2.3539 9.8051 2.2021
hfenergy: -1068.6269389 hartree
pointgroup: C01 [X(C19H18N2O3)]
dipole: -0.5241161 0.3846509 -1.0067145 debye
polarizability: 343.0498105|7.4631958|265.411332|-3.4653918|-8.6844096|120.7563855 unknown
InChI: InChI=1S/C19H18N2O3/c1-21(2)19(23)18(22)16-11-20-17-9-8-14(10-15(16)17)24-12-13-6-4-3-5-7-13/h3-11,20H,12H2,1-2H3
charge 0 multiplicity 1
42 atoms
O  2.505393 1.08381 0.002317
O  -2.127009 -1.443165 0.167612
O  -5.324125 -0.043261 0.648294
N  -2.672684 3.173114 -0.074402
N  -4.916759 -1.990174 -0.568701
C  -1.227632 1.401192 0.002006
C  -1.302751 2.828612 -0.071065
C  -2.601332 0.89995 0.034573
C  0.035826 0.760179 0.030597
C  -3.447214 2.032099 -0.010533
C  1.188241 1.576019 -0.021119
C  -0.151068 3.642108 -0.120551
C  1.098184 2.999227 -0.095834
C  -2.988794 -0.501811 0.075289
C  2.675525 -0.376716 0.067146
C  -4.503179 -0.827105 0.058206
C  4.156343 -0.696915 0.007974
C  5.061327 0.138103 -0.691909
C  4.639818 -1.87714 0.625171
C  -6.337657 -2.372477 -0.464673
C  -4.072328 -2.913055 -1.351471
C  6.428687 -0.207357 -0.776579
C  6.005778 -2.227121 0.53323
C  6.905471 -1.392257 -0.16894
H  0.072262 -0.328125 0.102437
H  -3.036424 4.124424 -0.098736
H  -4.532906 2.05739 0.037399
H  -0.212283 4.734206 -0.173842
H  2.029429 3.572344 -0.127294
H  2.139511 -0.836914 -0.791153
H  2.224339 -0.768454 1.00139
H  4.688667 1.059619 -1.14911
H  3.949904 -2.524262 1.181686
H  -6.812936 -2.377284 -1.464277
H  -6.851817 -1.644054 0.179647
H  -6.425941 -3.384845 -0.026955
H  -4.625686 -3.209238 -2.262807
H  -3.124358 -2.441517 -1.637847
H  -3.833324 -3.822165 -0.768388
H  7.12222 0.447965 -1.315817
H  6.367313 -3.142476 1.015125
H  7.966168 -1.659074 -0.236397
