program: Gaussian 09
title: 000259545
version: EM64L-G09RevD.01
frameworkgroup: C1[X(C14H14N4O2)]
method: RPBEPBE
basis: SDD
operation: Freq
keyword: #p
keyword: freq=noraman
keyword: PBEPBE/SDD
title: #p freq=noraman PBEPBE/SDD
converged: YES YES NO NO
title: Mulliken charges:
elementType: O O N N N N C C C C C C C C C C C C C C H H H H H H H H H H H H H H
charge: -0.227193 -0.260778 -0.257800 -0.023668 -0.037676 -0.068724 0.096854 0.450585 -0.102244 -0.242427 0.172292 -0.374740 -0.321308 -0.353854 -0.356730 0.329759 -0.363764 -0.222222 -0.675861 -0.537426 0.270821 0.239226 0.292486 0.245082 0.255964 0.247208 0.228610 0.229158 0.208189 0.233011 0.233279 0.222246 0.248875 0.222768
chargesum: 0.00000
title: Mulliken charges with hydrogens summed into heavy atoms:
elementType: O O N N N N C C C C C C C C C C C C C C
charge: -0.227193 -0.260778 -0.257800 -0.023668 -0.037676 -0.068724 0.096854 0.450585 -0.102244 0.028394 0.172292 -0.135514 -0.028822 -0.108772 -0.100766 0.329759 -0.116556 0.235546 -0.001382 0.156462
polarizability: 3.34623823e+02 5.55018486e+00 1.77460264e+02 -1.50934760e+00 -3.63365348e+00 9.23242781e+01
1716.lowfreq: -4.8256 -0.0005 -0.0005 0.0005 1.6947 8.8466 24.6480 33.0592 57.1462
frequency: 24.6254 33.0552 57.0952 67.0588 87.4868 105.9748 126.3897 148.9538 182.3897 195.4670 227.6002 239.7863 257.1386 260.6618 294.1543 316.4206 329.9895 367.7902 394.3991 414.1201 478.3469 514.9379 519.2827 557.6005 565.2075 619.0916 637.6850 650.1057 657.3207 662.3000 720.8566 727.4972 774.4911 785.7618 800.9141 802.4636 814.7342 822.3102 834.9014 858.3551 921.5113 928.8576 938.0944 961.9732 986.8200 1001.3515 1014.7231 1063.6181 1100.9125 1112.0462 1114.7014 1133.2016 1135.4218 1153.9840 1161.9078 1185.8824 1234.9125 1236.7312 1246.1642 1274.9155 1284.1863 1310.2868 1313.9808 1315.0573 1352.9085 1371.6906 1383.8310 1400.9609 1409.8993 1431.8980 1436.3668 1449.4160 1461.8635 1467.8903 1470.8918 1472.8482 1486.0531 1507.6297 1517.3325 1565.4278 1586.7513 1628.2994 2961.3622 2997.0556 3013.6642 3050.0225 3073.3139 3093.9379 3109.9679 3128.4125 3144.4590 3165.5335 3168.5700 3169.7500 3188.4856 3240.5183
redmass: 4.1575 4.0785 4.4492 3.1861 2.7545 2.9229 4.4138 4.4288 4.2777 4.9006 1.6198 1.3106 3.9322 2.6752 5.5412 4.1367 4.3555 5.2336 6.1428 3.0383 4.0575 3.9230 3.9774 5.9271 3.8499 6.6703 5.3246 7.1514 8.1460 7.3220 4.0751 5.8638 6.0942 5.2332 1.1007 1.3184 4.6547 1.6600 1.6112 7.4779 1.4388 1.3740 7.9931 1.3574 8.4623 2.7980 2.1983 4.4838 2.7334 1.2640 1.5705 1.4458 4.1516 1.9085 1.7707 1.2833 2.7846 2.1225 1.1412 5.6601 3.0755 2.5547 5.2253 1.5989 1.4727 7.0374 6.0572 1.2802 1.9013 2.8595 1.3411 3.8045 1.0398 1.0510 1.0833 1.0772 1.0860 2.7781 6.7808 9.9648 7.6503 6.3252 1.0330 1.0359 1.0581 1.1040 1.1065 1.0985 1.1027 1.0994 1.0885 1.0897 1.0922 1.0952 1.0967 1.0979
irintensity: 1.5429 0.3146 0.6138 0.4115 0.1678 9.7168 3.6427 0.1792 3.9036 1.1624 0.3615 0.5474 2.7343 2.6168 0.9003 2.9322 4.9594 0.8150 0.6706 0.1295 0.0169 6.8355 11.3876 21.6701 3.1583 21.5958 23.0738 28.1634 0.3633 3.3984 0.6446 0.4362 0.9984 12.3919 3.4874 19.2986 8.4318 20.9433 61.7788 5.0379 13.1294 0.5323 89.8550 2.9638 47.7461 9.0392 37.6125 166.3577 1.7336 0.1015 3.2804 5.2513 27.4260 27.7506 62.2207 92.5280 265.9056 6.9772 0.0778 84.7561 253.8700 22.2022 252.3723 5.0419 2.7721 1.7494 25.6080 67.5753 38.8604 6.2351 20.9296 23.4430 11.9007 16.3979 24.3276 72.8074 16.3932 421.8061 36.7716 299.9447 11.9256 27.4583 75.5548 25.0523 22.4848 47.5876 6.6502 30.4831 42.6781 25.7370 12.7292 3.2171 14.9058 7.5623 3.1682 0.1437
temp: 298.150 k
press: 1.00000 atm
elementType: 8 8 7 7 7 7 6 6 6 6 6 6 6 6 6 6 6 6 6 6 1 1 1 1 1 1 1 1 1 1 1 1 1 1
symmnumber: 1
zpe: 687691.1 jmol-1
zpe.correction: 0.261928 hartree
zpe.thermalcorrener: 0.279469 hartree
zpe.thermalcorrenthalpy: 0.280414 hartree
zpe.thermalcorrgfe: 0.215109 hartree
zpe.sumelectzpe: -909.891734 hartree
zpe.sumelectthermal: -909.874192 hartree
zpe.sumelectthermalent: -909.873248 hartree
zpe.sumelectthermalfe: -909.938552 hartree
dipole: -2.8819 -0.9886 0.5869
dipole: 3.1027
quadrupole: -81.6060 -116.7578 -118.0711
quadrupole: 16.8298 -3.0198 -3.4073
quadrupole: 23.8723 -11.2795 -12.5928 16.8298 -3.0198 -3.4073
hfenergy: -910.1536613 hartree
pointgroup: C01 [X(C14H14N4O2)]
dipole: -1.1301635 0.3891865 -0.2477809 debye
polarizability: 334.5259934|-6.463844|177.2519705|2.838914|-6.1489362|92.6304011 unknown
InChI: InChI=1S/C14H14N4O2/c1-3-20-14-12-13(15-8-16-14)18(9-17-12)10-4-6-11(19-2)7-5-10/h4-9H,3H2,1-2H3
charge 0 multiplicity 1
34 atoms
O  4.430706 0.499064 0.01831
O  -5.775771 -0.596601 0.071629
N  -0.23818 0.59353 0.109979
N  1.686452 1.866625 0.220177
N  0.807478 -1.660791 -0.130202
N  3.253551 -1.54949 -0.169819
C  0.83996 -0.303447 0.006122
C  -1.645731 0.302286 0.072102
C  2.018135 0.508593 0.068776
C  0.345166 1.872676 0.242046
C  3.252067 -0.194154 -0.028993
C  -2.552116 1.280128 -0.396693
C  -2.133797 -0.957035 0.509171
C  -3.940303 1.026651 -0.40546
C  -3.512749 -1.217231 0.488767
C  -4.42485 -0.227988 0.040567
C  2.051253 -2.207107 -0.212698
C  5.697837 -0.291258 -0.089918
C  6.833938 0.723004 -0.023261
C  -6.759107 0.386356 -0.391374
H  -0.260058 2.764339 0.384984
H  -2.184649 2.237592 -0.78042
H  -1.430581 -1.726508 0.835177
H  -4.620228 1.7999 -0.773587
H  -3.907109 -2.182808 0.818145
H  2.10087 -3.293712 -0.325641
H  5.725117 -1.02077 0.739103
H  5.678833 -0.852851 -1.040866
H  7.80507 0.200245 -0.097133
H  6.763525 1.448336 -0.851591
H  6.80866 1.280735 0.928295
H  -6.731737 1.304691 0.226915
H  -7.734503 -0.108212 -0.276848
H  -6.596147 0.647613 -1.45506
