program: Gaussian 09
title: 000259540
version: EM64L-G09RevD.01
frameworkgroup: C1[X(C11H11ClN4O)]
method: RPBEPBE
basis: SDD
operation: Freq
keyword: #p
keyword: freq=noraman
keyword: PBEPBE/SDD
title: #p freq=noraman PBEPBE/SDD
converged: YES YES NO NO
title: Mulliken charges:
elementType: Cl O N N N N C C C C C C C C C C C H H H H H H H H H H H
charge: -0.049690 -0.263686 -0.468169 -0.079289 -0.661396 0.051956 0.462769 0.178748 -0.470778 -0.306681 0.322970 -0.328414 -0.358231 0.246867 -0.275966 -0.364425 -0.537888 0.318837 0.216346 0.315519 0.240978 0.250328 0.305283 0.319140 0.250356 0.218648 0.219642 0.246226
chargesum: 0.00000
title: Mulliken charges with hydrogens summed into heavy atoms:
elementType: Cl O N N N N C C C C C C C C C C C
charge: -0.049690 -0.263686 -0.149332 -0.079289 -0.036972 0.051956 0.462769 0.178748 -0.254432 0.008838 0.322970 -0.087436 -0.107904 0.246867 -0.275966 -0.114069 0.146629
polarizability: 3.20639234e+02 -4.21606223e+00 1.65862219e+02 -8.66962571e-01 -1.60565788e+00 6.92239708e+01
1716.lowfreq: -8.8076 -0.0025 -0.0020 -0.0014 1.3296 5.7749 30.9761 38.5967 73.1371
frequency: 30.9549 38.5340 73.1266 83.9241 114.6202 165.0798 183.6287 198.1475 212.0365 238.0440 241.5742 301.6104 310.2469 324.2645 364.2845 383.8546 414.8426 416.6190 482.3429 522.3593 525.1516 545.1483 586.4077 591.2295 628.3554 640.2661 670.7691 696.2227 721.9040 741.9473 763.8213 790.0156 798.9738 821.7715 849.3491 902.2179 915.3456 915.9620 986.2735 989.2215 1001.1294 1083.8560 1113.4838 1115.7048 1136.0557 1157.2765 1183.2924 1189.4464 1220.3878 1249.5183 1298.4341 1304.6025 1332.5534 1366.5506 1393.9122 1422.9164 1437.0975 1454.2163 1463.5930 1466.9627 1473.3671 1503.9753 1551.3812 1559.7343 1596.3266 1629.3571 1637.5600 2955.5968 3041.8717 3108.5038 3124.4565 3161.8131 3165.0645 3179.2747 3194.4823 3477.1849 3494.0637 3605.9245
redmass: 7.3500 3.9983 5.7745 4.7214 4.7379 4.2222 6.8143 4.3847 5.4654 1.4125 2.9404 4.0736 3.8445 1.3999 13.4439 4.6076 3.1193 4.4969 4.4227 2.5654 4.7031 4.8965 6.4570 4.6751 6.5660 1.4012 1.4055 5.2099 3.6029 6.1809 5.9747 8.7153 1.4130 4.9857 1.4835 1.4468 3.0412 1.6100 1.9948 2.6173 2.6835 1.9961 1.2595 1.4515 3.5105 1.3282 1.2356 3.4746 2.3291 3.9200 5.7893 1.3256 3.0181 5.4355 1.7189 4.3248 1.1882 3.4897 3.8587 1.0510 1.0875 2.4820 4.0387 4.8496 3.9665 4.7285 1.2716 1.0332 1.1038 1.0897 1.0990 1.0907 1.0930 1.0926 1.0954 1.0455 1.0749 1.1002
irintensity: 0.1455 0.0952 1.7265 3.5972 1.1365 2.3734 4.1234 3.3515 0.7129 1.3588 2.0080 1.0542 7.7992 32.0552 16.9343 2.2142 0.3275 3.8255 0.4934 26.3769 21.3511 10.3453 7.1559 26.5874 8.5777 245.6487 56.8680 18.3530 0.3464 17.8666 19.0338 23.4981 47.3494 4.7928 64.5771 11.4713 31.3161 8.7834 27.5064 30.0119 31.9114 182.8964 0.2124 13.7035 6.1212 2.1673 70.7539 21.3086 243.2052 15.2866 16.6728 3.5960 64.1644 10.1466 67.6891 21.0027 30.3545 101.3754 118.2330 14.1885 131.9702 295.6240 762.4402 2.0325 167.6978 8.1381 104.6143 89.4233 52.5852 22.8722 24.6878 5.2052 14.1346 12.0169 11.0496 28.3315 20.8731 35.5849
temp: 298.150 k
press: 1.00000 atm
elementType: 17 8 7 7 7 7 6 6 6 6 6 6 6 6 6 6 6 1 1 1 1 1 1 1 1 1 1 1
symmnumber: 1
zpe: 550469.9 jmol-1
zpe.correction: 0.209663 hartree
zpe.thermalcorrener: 0.225122 hartree
zpe.thermalcorrenthalpy: 0.226066 hartree
zpe.thermalcorrgfe: 0.165944 hartree
zpe.sumelectzpe: -1178.829084 hartree
zpe.sumelectthermal: -1178.813625 hartree
zpe.sumelectthermalent: -1178.812681 hartree
zpe.sumelectthermalfe: -1178.872803 hartree
dipole: 3.6897 -5.3843 -0.7678
dipole: 6.5722
quadrupole: -107.8426 -94.5881 -109.5733
quadrupole: 0.2581 3.9775 1.3116
quadrupole: -3.8413 9.4133 -5.5720 0.2581 3.9775 1.3116
hfenergy: -1179.0387465 hartree
pointgroup: C01 [X(C11H11Cl1N4O1)]
dipole: 1.5472706 -2.0653386 0.1620939 debye
polarizability: 320.6359586|3.3574822|161.0019034|3.9393711|-21.0045459|74.0875621 unknown
InChI: InChI=1S/C11H11ClN4O/c1-17-8-4-2-7(3-5-8)16-11-9(13)10(12)14-6-15-11/h2-6,16H,13H2,1H3
charge 0 multiplicity 1
28 atoms
Cl -5.593591 -0.879146 0.103723
O  5.066356 0.723934 -0.126992
N  -0.394412 -0.758568 0.191103
N  -1.56487 1.295679 -0.25717
N  -2.786835 -2.201876 0.191981
N  -3.988149 1.310787 -0.241093
C  0.966865 -0.344481 0.115973
C  -1.56766 -0.05223 -0.026235
C  1.951703 -1.291576 0.497122
C  1.382895 0.940503 -0.332408
C  3.731993 0.297383 -0.019122
C  3.326233 -0.981942 0.434662
C  2.752229 1.247445 -0.399263
C  -2.806129 -0.807994 0.01883
C  -3.96983 -0.019992 -0.058723
C  -2.773453 1.91148 -0.368092
C  6.10909 -0.225879 0.263271
H  -0.542987 -1.687048 0.598603
H  1.647054 -2.286472 0.848492
H  0.627136 1.678446 -0.603814
H  4.057182 -1.73708 0.73788
H  3.085118 2.232103 -0.741476
H  -2.148015 -2.745252 -0.393387
H  -3.693539 -2.641414 0.365932
H  -2.769031 2.985913 -0.565865
H  6.082427 -1.136573 -0.367221
H  6.017005 -0.510859 1.329942
H  7.058215 0.306407 0.103549
