program: Gaussian 09
title: 000259601
version: EM64L-G09RevD.01
frameworkgroup: C1[X(C17H25N3O5)]
method: RPBEPBE
basis: SDD
operation: Freq
keyword: #p
keyword: freq=noraman
keyword: PBEPBE/SDD
title: #p freq=noraman PBEPBE/SDD
converged: YES YES NO NO
title: Mulliken charges:
elementType: O O O O O N N N C C C C C C C C C C C C C C C C C H H H H H H H H H H H H H H H H H H H H H H H H H
charge: -0.278130 -0.394166 -0.323937 -0.230488 -0.431554 -0.375044 -0.372732 -0.542794 -0.476170 -0.235726 -0.000645 0.260768 -0.151594 -0.714428 -0.721260 -0.579864 0.537877 0.274190 0.142918 -0.520282 -0.369846 -0.412175 -0.397854 -0.412290 0.275482 0.229790 0.224808 0.288712 0.192394 0.282251 0.214032 0.215520 0.210835 0.226616 0.215145 0.209812 0.308898 0.352844 0.221593 0.265481 0.263689 0.239723 0.219088 0.246523 0.257499 0.233133 0.383843 0.285889 0.305164 0.356464
chargesum: 0.00000
title: Mulliken charges with hydrogens summed into heavy atoms:
elementType: O O O O O N N N C C C C C C C C C C C C C C C C C
charge: -0.278130 -0.010323 -0.323937 -0.230488 -0.075090 -0.066146 -0.019889 0.048259 -0.021572 0.052986 0.191749 0.260768 0.130658 -0.074042 -0.069687 -0.092790 0.537877 0.274190 0.142918 -0.054671 -0.106157 -0.172452 -0.140355 -0.179157 0.275482
polarizability: 2.21163755e+02 1.43499909e+01 2.36296381e+02 -2.11016141e+01 1.04333265e+01 1.90555260e+02
1716.lowfreq: -15.2859 -10.5885 -4.6017 -0.0009 -0.0007 0.0005 8.0380 14.6106 17.0247
frequency: -11.4887 13.8764 15.1164 19.4919 33.0010 44.3967 50.2067 67.0384 71.2911 78.3540 87.1825 90.5088 103.3140 131.1575 159.4233 176.8882 184.8574 202.3433 223.3403 237.7001 244.9791 263.0410 276.0045 288.0678 301.4953 316.9309 327.2921 349.0937 360.4614 383.3477 398.6792 410.4075 411.3066 416.1936 430.0413 480.5120 493.7075 511.2284 544.1096 561.5210 575.4995 584.6366 621.5910 637.1794 664.8813 683.4189 685.7920 704.4616 754.1261 757.7465 762.0023 802.1566 804.3312 818.9675 823.8981 829.6917 840.5633 880.6369 883.0483 894.5707 910.1824 914.1808 936.8214 943.7619 954.5915 961.9767 970.3582 998.0405 1005.4296 1038.0506 1080.5299 1090.6637 1110.8972 1122.3484 1128.4502 1140.3383 1143.7029 1146.1553 1161.7748 1175.1332 1186.3169 1200.4490 1210.8033 1217.5274 1228.0871 1250.4767 1261.4275 1272.0807 1281.7270 1305.8582 1308.4919 1310.8522 1318.3158 1326.1792 1329.2323 1333.5625 1350.5251 1353.6650 1357.4810 1381.0502 1390.8338 1398.0795 1426.7719 1431.7397 1452.8898 1458.9994 1467.6398 1470.3232 1478.7311 1482.4620 1491.0392 1509.3090 1524.9585 1582.5814 1596.6073 1623.1231 1627.3417 1645.2709 1660.8921 2957.9147 2967.8257 2971.9872 2976.6207 2983.5068 2986.1587 2988.4274 3021.3141 3040.1362 3042.2295 3048.2308 3060.5049 3068.1158 3069.9158 3073.8286 3110.2117 3132.1399 3135.1925 3168.1691 3331.0216 3425.3500 3505.6327 3533.6375 3548.5077 3581.7274
redmass: 2.8783 6.2724 4.9787 4.1755 4.0911 4.0093 4.0437 4.9295 4.7578 4.3472 5.7653 5.7292 5.0213 5.6239 2.7816 4.8285 3.5951 1.1395 2.7394 1.4275 4.6102 1.7453 2.8599 2.5231 4.8536 3.2333 3.3434 4.4939 1.1768 2.7231 2.9002 2.7550 2.2293 3.6727 3.4761 3.8578 4.3485 3.0421 3.1743 3.0283 2.8588 1.3858 1.8234 6.2005 4.8878 2.2614 2.4317 3.2763 4.5857 3.7754 2.9515 1.4473 1.4392 2.3773 4.8964 1.3578 1.7729 1.9700 2.0307 2.8511 3.6941 1.2315 1.9549 1.9096 1.6336 1.8885 1.3583 2.2027 2.8407 2.8110 2.1112 2.9028 1.6011 2.4200 3.2462 1.4618 1.8517 1.7035 2.0966 1.7857 1.1763 1.3690 1.4536 2.0554 1.8379 2.6204 1.7847 1.3725 1.4028 1.5012 1.6866 1.5226 1.3413 1.3555 1.4275 1.3858 1.3226 1.5875 1.4083 1.2139 4.7365 1.2156 2.5589 1.0957 1.1894 1.1100 1.0551 1.1068 1.5767 1.0595 1.0601 2.6404 1.8377 5.7512 5.8802 4.8581 6.1774 9.3250 1.0806 1.0831 1.0359 1.0365 1.0790 1.0597 1.0621 1.0617 1.0836 1.1005 1.1028 1.0991 1.0996 1.0993 1.0992 1.0987 1.0875 1.0915 1.0952 1.0951 1.0833 1.0464 1.0638 1.0774 1.0954 1.0660
irintensity: 0.0317 1.1295 0.8063 0.5323 0.8961 0.3153 0.4687 0.4855 0.6173 0.2690 7.5306 5.9487 3.5446 2.1292 2.7438 9.6769 1.4726 1.5490 4.4996 1.9130 11.3843 82.4453 17.9745 11.4577 3.8825 19.3272 35.7384 3.2855 101.3743 4.0931 8.5150 0.4842 2.4107 3.4254 2.2598 3.4507 23.1111 28.4299 91.3776 7.6511 70.5497 60.6704 69.1832 9.7557 26.9787 130.1216 15.8281 0.1777 18.3023 57.3428 156.7849 65.0982 63.0069 6.3498 50.5872 6.2593 9.4374 19.0198 15.8551 34.5567 5.3595 3.0401 2.0135 6.7552 2.4532 3.9024 0.5643 6.9813 1.5955 47.8822 196.0384 15.8443 42.2797 7.1991 4.4591 3.3981 85.2433 109.3214 7.4019 8.1169 10.7375 1.4960 4.7507 0.3610 30.0491 24.9726 40.5487 13.7169 24.8451 0.7310 23.7247 16.8045 6.5960 1.5265 30.8979 6.9952 3.6214 7.2110 1.9609 17.9502 14.4098 16.3851 18.3831 13.8631 47.3204 26.3345 9.8831 28.5968 83.8537 10.9580 22.3060 86.2345 247.6145 39.8397 2.0689 192.9901 42.9395 271.6625 19.5400 21.7636 37.2071 24.6063 35.5085 26.3655 13.1104 5.1537 2.1467 9.0793 19.0101 11.5129 20.3403 42.2187 46.3810 82.4152 13.0827 6.8259 8.7043 3.7731 172.1493 16.0764 29.1929 16.3395 23.2193 42.3610
temp: 298.150 k
press: 1.00000 atm
elementType: 8 8 8 8 8 7 7 7 6 6 6 6 6 6 6 6 6 6 6 6 6 6 6 6 6 1 1 1 1 1 1 1 1 1 1 1 1 1 1 1 1 1 1 1 1 1 1 1 1 1
symmnumber: 1
zpe: 1070254.0 jmol-1
zpe.correction: 0.407638 hartree
zpe.thermalcorrener: 0.434038 hartree
zpe.thermalcorrenthalpy: 0.434982 hartree
zpe.thermalcorrgfe: 0.347517 hartree
zpe.sumelectzpe: -1201.308996 hartree
zpe.sumelectthermal: -1201.282596 hartree
zpe.sumelectthermalent: -1201.281652 hartree
zpe.sumelectthermalfe: -1201.369118 hartree
dipole: 0.9870 -2.4032 1.7971
dipole: 3.1590
quadrupole: -136.1080 -148.7759 -159.8563
quadrupole: 7.0751 -4.9322 6.0172
quadrupole: 12.1387 -0.5291 -11.6095 7.0751 -4.9322 6.0172
hfenergy: -1201.7166345 hartree
pointgroup: C01 [X(C17H25N3O5)]
dipole: 0.5151192 -1.0604834 0.3932788 debye
polarizability: 216.1421685|19.1781444|230.9474758|-18.6407299|19.0383208|200.925752 unknown
InChI: InChI=1S/C17H25N3O5/c1-10(2)7-13(19-15(22)9-18)16(23)20-14(17(24)25)8-11-3-5-12(21)6-4-11/h3-6,10,13-14,19-21,24H,7-9,18H2,1-2H3
charge 0 multiplicity 1
50 atoms
O  1.069024 1.879054 -1.363092
O  0.516873 3.8354 2.026628
O  0.878326 -0.968562 2.214833
O  -1.73172 4.347001 1.792462
O  -3.336562 -3.094527 -2.197031
N  1.725118 -1.125096 0.05826
N  0.304871 1.447198 0.800641
N  -0.725464 -3.349496 1.706327
C  3.454559 0.349727 -0.967565
C  2.304759 0.24207 0.049578
C  4.671194 -0.569564 -0.682223
C  1.181303 1.276817 -0.249454
C  -0.860211 2.31697 0.686668
C  5.689744 -0.454722 -1.841505
C  5.346949 -0.242495 0.671241
C  -2.199307 1.587557 0.996466
C  -2.464637 0.346843 0.15155
C  1.058592 -1.645257 1.143783
C  -0.769513 3.58523 1.547437
C  0.539229 -3.09623 1.007536
C  -2.014919 0.213753 -1.189821
C  -3.227533 -0.713552 0.701529
C  -2.316538 -0.932097 -1.953031
C  -3.542008 -1.86942 -0.049143
C  -3.079816 -1.97663 -1.383283
H  3.788358 1.404847 -0.985257
H  3.053829 0.151613 -1.98181
H  2.667805 0.431219 1.076843
H  4.318337 -1.622267 -0.640351
H  -0.865067 2.677468 -0.363697
H  5.229514 -0.717108 -2.812644
H  6.553638 -1.12571 -1.681112
H  6.075746 0.579842 -1.92126
H  4.671452 -0.413774 1.529196
H  6.241224 -0.87438 0.823642
H  5.672578 0.815427 0.698376
H  1.74609 -1.650826 -0.819001
H  0.435477 0.848833 1.634502
H  -2.216228 1.310498 2.068518
H  -3.007945 2.331437 0.861878
H  -1.410371 1.001135 -1.654463
H  -3.586599 -0.638116 1.735277
H  0.42182 -3.35738 -0.061662
H  1.315672 -3.771024 1.417888
H  -1.971161 -1.031876 -2.986365
H  -4.144369 -2.671136 0.398118
H  0.504887 4.688574 2.541477
H  -0.649113 -3.168495 2.714232
H  -1.510216 -2.820678 1.304201
H  -3.869174 -3.771494 -1.710321
