program: Gaussian 09
title: 000259663
version: EM64L-G09RevD.01
frameworkgroup: C1[X(C20H22N6O6)]
method: RPBEPBE
basis: SDD
operation: Freq
keyword: #p
keyword: freq=noraman
keyword: PBEPBE/SDD
title: #p freq=noraman PBEPBE/SDD
converged: YES YES NO NO
title: Mulliken charges:
elementType: O O O O O O N N N N N N C C C C C C C C C C C C C C C C C C C C H H H H H H H H H H H H H H H H H H H H H H
charge: -0.265791 -0.422237 -0.443170 -0.280473 -0.266301 -0.218993 -0.185090 -0.080803 -0.009426 -0.134976 -0.621036 -0.379977 -0.028457 -0.135940 -0.240966 -0.088510 -0.430710 -0.294746 0.221865 -0.222615 -0.152729 0.179894 0.020269 0.208805 0.204056 0.237341 -0.346670 -0.335287 -0.222076 -0.218176 -0.793965 -0.245717 0.308505 0.215784 0.317798 0.220903 0.245330 0.199544 0.248222 0.237158 0.353261 0.356099 0.271125 0.330088 0.348703 0.333485 0.269075 0.308610 0.230226 0.227581 0.218674 0.253964 0.269271 0.229203
chargesum: 0.00000
title: Mulliken charges with hydrogens summed into heavy atoms:
elementType: O O O O O O N N N N N N C C C C C C C C C C C C C C C C C C C C
charge: -0.265791 -0.068976 -0.087071 -0.280473 -0.266301 -0.218993 -0.185090 -0.080803 -0.009426 -0.134976 0.057755 -0.046492 0.280048 0.079844 0.076831 0.132393 0.014164 0.190633 0.221865 0.048510 -0.152729 0.179894 0.020269 0.208805 0.204056 0.237341 -0.077596 -0.026677 0.008151 0.009405 -0.052056 -0.016515
polarizability: 3.28004248e+02 -3.21999626e+01 2.91797111e+02 -3.80303825e+01 1.52116085e+01 2.28962726e+02
1716.lowfreq: -7.2890 -4.1427 -2.1832 -0.0005 0.0003 0.0006 8.2889 17.3004 18.5571
frequency: 6.5659 17.1841 18.4139 36.2955 41.4867 52.1998 59.8304 64.5822 70.6744 72.4983 82.1885 91.1752 99.7968 124.0230 133.4975 140.2740 159.1798 185.0109 196.9817 209.1473 224.4849 231.1877 242.0724 265.2855 280.4245 297.2160 304.3692 310.1484 315.9834 343.8582 351.8294 359.9114 382.0898 395.9662 407.6234 437.4375 442.9841 480.0936 488.5428 495.3255 513.6988 521.9027 542.1365 543.7325 562.8313 576.1272 588.5356 608.5254 613.1748 630.8730 640.0888 661.8919 669.5998 681.0037 685.5652 702.3739 705.1802 737.0130 752.6167 782.5479 789.3143 796.4367 815.9898 819.6753 834.2715 859.9083 871.5228 895.5030 917.4765 933.1592 943.8748 959.5757 982.2654 989.3450 1000.8517 1001.1668 1006.7262 1011.1684 1014.0723 1021.0117 1026.9318 1041.2052 1045.1124 1053.8663 1066.2081 1073.3479 1086.0811 1087.8240 1088.8825 1138.9487 1167.4401 1170.8477 1183.8714 1184.7419 1191.5915 1193.7593 1211.2809 1220.5199 1236.2380 1243.2836 1245.0698 1251.6493 1285.5783 1292.5257 1295.2148 1313.4436 1314.3480 1317.2024 1332.9950 1359.1658 1366.2200 1380.7349 1385.5838 1387.8151 1390.6545 1395.8616 1408.5277 1428.1794 1431.6256 1434.6966 1436.3924 1450.9101 1467.6524 1473.0700 1476.3996 1479.8600 1503.8559 1562.9031 1582.2615 1582.7338 1609.3082 1617.3746 1632.6579 1638.0795 2947.7256 2993.5677 2995.4162 3009.6963 3017.8462 3026.0122 3032.2796 3063.1206 3086.0673 3088.7748 3107.7669 3124.5172 3139.2807 3151.5929 3164.7064 3177.4214 3230.1979 3538.4038 3542.3077 3561.6884 3581.7670 3696.0903
redmass: 6.0075 5.6917 6.0349 5.4889 4.7682 5.6983 4.8261 5.5271 3.3537 4.9672 4.7422 5.7140 1.7027 5.7973 5.2777 4.8962 4.6710 5.7817 3.9790 4.9038 4.1937 4.6405 6.6509 4.1128 5.6764 1.2996 3.7735 3.0252 3.8457 3.9906 1.9984 2.1572 5.9563 4.6296 2.8808 3.6682 3.7579 4.7039 4.4319 4.8055 1.2314 5.4306 2.2545 1.5408 3.0350 4.9799 3.4881 5.6097 6.4276 4.4892 5.4913 6.5282 6.2485 5.1312 1.8539 4.5968 1.6318 2.8691 2.9802 6.7503 3.6449 2.1327 3.0638 2.7401 8.2274 4.8305 1.2404 2.4232 4.7211 3.9894 5.0700 1.4141 3.9476 5.7615 2.0403 1.3781 2.6624 4.6122 1.3338 2.4907 4.2642 1.6420 2.7514 3.0243 3.1228 3.1825 2.2765 2.1320 2.2661 2.0771 1.9594 1.0597 1.3311 1.2451 2.0828 1.1371 1.9458 1.2496 2.3096 1.7704 3.1001 1.3566 1.6905 2.3950 1.4224 1.2573 6.4697 1.3142 1.3028 1.7962 1.5910 1.6494 1.3519 7.7894 2.8915 1.6253 2.8846 1.7142 1.1036 2.6125 3.1304 1.0996 2.5487 1.3503 1.6282 1.3187 2.2454 4.0992 2.5171 6.7891 6.2387 9.5062 2.8600 4.8905 1.0830 1.0361 1.0613 1.0855 1.0588 1.0861 1.0869 1.0998 1.1080 1.0990 1.0996 1.0853 1.0891 1.0941 1.0983 1.0970 1.0984 1.0759 1.0448 1.0660 1.0667 1.1056
irintensity: 0.0608 0.9762 1.2898 0.1364 1.1279 2.4304 5.0641 2.1539 4.6491 1.0021 0.9298 1.6245 1.9049 4.2333 2.9155 2.6167 1.8229 4.0440 1.7227 10.2710 5.9477 4.5948 7.5545 9.8996 7.7377 94.4556 12.9738 24.5710 8.1126 4.5123 77.1107 68.4105 5.0030 9.7380 0.3497 7.0658 0.7990 8.5547 1.8125 15.0677 238.6664 9.6824 17.8074 10.2372 12.2950 3.1892 1.6148 2.4594 0.4818 21.9078 21.9616 5.5851 4.9567 10.6602 22.3370 11.1751 108.3463 50.5155 8.8999 38.7172 43.2898 24.1438 3.4403 7.3927 47.5842 9.4344 3.1795 3.8656 0.4846 115.5795 89.0772 12.5896 41.0347 0.3112 17.2706 0.2352 18.8271 20.3722 3.7598 66.6986 40.6601 15.2644 18.4627 26.6457 275.4183 45.6880 11.0333 7.1861 24.8888 18.7180 22.0395 2.1175 12.7048 10.4932 81.5455 2.1176 105.0776 2.4994 33.5639 68.8115 305.7918 13.8410 3.8237 7.3151 7.5903 38.6323 1.9006 2.6754 0.6287 52.8616 37.2380 33.2990 123.6778 26.3380 75.2785 14.2672 126.3557 29.3766 27.6378 241.3955 256.9402 15.0880 144.9021 71.1989 25.9414 3.1390 325.8496 71.4446 66.0487 47.0151 17.3311 174.6397 223.5734 503.8435 40.1957 12.0143 17.6435 25.9110 19.0322 0.9988 9.2531 17.4375 20.6633 14.9742 12.8970 1.8037 21.4532 20.7219 18.2767 9.9805 0.1023 27.1052 146.0922 10.2894 12.2394 48.1940
temp: 298.150 k
press: 1.00000 atm
elementType: 8 8 8 8 8 8 7 7 7 7 7 7 6 6 6 6 6 6 6 6 6 6 6 6 6 6 6 6 6 6 6 6 1 1 1 1 1 1 1 1 1 1 1 1 1 1 1 1 1 1 1 1 1 1
symmnumber: 1
zpe: 1086325.0 jmol-1
zpe.correction: 0.413759 hartree
zpe.thermalcorrener: 0.443682 hartree
zpe.thermalcorrenthalpy: 0.444626 hartree
zpe.thermalcorrgfe: 0.348830 hartree
zpe.sumelectzpe: -1552.870800 hartree
zpe.sumelectthermal: -1552.840878 hartree
zpe.sumelectthermalent: -1552.839933 hartree
zpe.sumelectthermalfe: -1552.935729 hartree
dipole: 4.1944 3.9429 2.6592
dipole: 6.3412
quadrupole: -168.9473 -154.7386 -188.1198
quadrupole: -8.5669 -6.3272 -0.5933
quadrupole: 1.6546 15.8633 -17.5179 -8.5669 -6.3272 -0.5933
hfenergy: -1553.284559 hartree
pointgroup: C01 [X(C20H22N6O6)]
dipole: 1.6546975 -1.4594488 -1.164529 debye
polarizability: 327.8085886|29.1947171|289.1708107|40.443796|20.0862954|231.7846856 unknown
InChI: InChI=1S/C20H22N6O6/c1-10(27)23-20-24-16(21)13-17(25-20)26(9-22-13)18-15(29)14(28)12(32-18)7-8-31-19(30)11-5-3-2-4-6-11/h2-6,9,12,14-15,18,23,28-29H,7-8,21H2,1H3
charge 0 multiplicity 1
54 atoms
O  1.43029 2.216424 0.905601
O  0.379623 3.073664 -2.511522
O  3.476225 2.985367 -2.01194
O  -2.390207 1.625853 0.842482
O  -3.752611 1.428172 2.723824
O  -0.734692 -0.864743 -1.91724
N  3.356135 0.793416 0.559228
N  4.77468 -0.677451 1.616555
N  1.816476 -0.830593 -0.515609
N  2.44463 -3.158441 -0.008176
N  4.318356 -3.727407 1.312679
N  0.583451 -2.730039 -1.30858
C  0.355127 2.455534 -0.13331
C  1.148218 3.104138 -1.27978
C  2.427263 2.251861 -1.304406
C  2.721938 2.069182 0.212521
C  -0.716931 3.339317 0.496258
C  -1.552623 2.62834 1.561277
C  2.892249 -0.491299 0.2478
C  4.477324 0.613484 1.395482
C  3.783799 -1.378788 0.902906
C  3.522797 -2.77304 0.739428
C  1.658022 -2.178461 -0.58084
C  -3.477034 1.100161 1.541126
C  -4.263456 0.142219 0.708339
C  -0.523044 -2.105821 -1.912153
C  -5.465038 -0.378967 1.25603
C  -3.849905 -0.241053 -0.594511
C  -6.257434 -1.269073 0.502828
C  -4.650819 -1.130982 -1.343441
C  -1.497403 -3.097675 -2.552571
C  -5.85368 -1.643272 -0.80181
H  -0.049764 1.47949 -0.462905
H  1.43353 4.146415 -1.009825
H  2.200964 1.278416 -1.779303
H  3.405832 2.868463 0.558248
H  -1.382857 3.703547 -0.3084
H  -0.226515 4.218057 0.959237
H  -0.92115 2.095927 2.294466
H  -2.219429 3.322778 2.10231
H  0.945219 3.439674 -3.238228
H  4.179966 2.358795 -2.313313
H  5.024221 1.460863 1.80439
H  4.09042 -4.711229 1.189204
H  5.111721 -3.441759 1.882906
H  0.61916 -3.752495 -1.319976
H  -5.756938 -0.069746 2.265285
H  -2.912131 0.141784 -1.007969
H  -7.18676 -1.666099 0.925774
H  -4.339243 -1.413113 -2.355445
H  -1.088688 -4.116514 -2.666576
H  -1.790525 -2.716288 -3.544621
H  -2.410725 -3.149252 -1.932679
H  -6.473731 -2.328243 -1.391759
