program: Gaussian 09
title: 000259537
version: EM64L-G09RevD.01
frameworkgroup: C1[X(C16H16N2O2)]
method: RPBEPBE
basis: SDD
operation: Freq
keyword: #p
keyword: freq=noraman
keyword: PBEPBE/SDD
title: #p freq=noraman PBEPBE/SDD
converged: YES YES NO NO
title: Mulliken charges:
elementType: O O N N C C C C C C C C C C C C C C C C H H H H H H H H H H H H H H H H
charge: -0.308438 -0.308302 -0.331998 -0.331587 0.169227 0.169423 0.321366 0.321214 0.155247 0.154679 -0.371195 -0.371733 -0.404084 -0.404396 -0.785619 -0.786232 -0.247331 -0.246952 -0.219399 -0.219471 0.247637 0.248161 0.235565 0.235524 0.233530 0.211930 0.265380 0.212098 0.265779 0.233287 0.361119 0.361284 0.235007 0.234995 0.232132 0.232154
chargesum: 0.00000
title: Mulliken charges with hydrogens summed into heavy atoms:
elementType: O O N N C C C C C C C C C C C C C C C C
charge: -0.308438 -0.308302 0.029120 0.029696 0.169227 0.169423 0.321366 0.321214 0.155247 0.154679 -0.123558 -0.123572 -0.168519 -0.168872 -0.074778 -0.075067 -0.012325 -0.011957 0.012733 0.012682
polarizability: 3.21528915e+02 -1.19106787e+01 1.84095943e+02 -3.50943140e-02 -5.75133977e-03 1.22371805e+02
1716.lowfreq: -3.6748 -0.0005 -0.0002 0.0002 1.5295 5.0206 22.0404 28.7324 42.7374
frequency: 21.9685 28.7135 42.7264 50.5483 96.5712 104.4622 113.0239 124.9202 132.7099 167.2290 190.5071 193.5489 235.1955 238.5476 304.2703 312.3969 354.4791 375.0958 376.5751 403.1937 432.6735 456.2781 479.2404 507.5184 535.7849 552.5977 560.5297 603.2889 610.7868 652.2081 657.7637 681.6845 701.5920 738.7454 740.6627 768.2429 778.3173 784.1439 786.4181 822.9269 878.7083 879.3696 916.2875 955.9554 956.6475 993.1897 993.2262 994.5771 994.6120 1030.8941 1046.5421 1047.4848 1050.3989 1051.7463 1072.3409 1131.6634 1141.9214 1178.7053 1178.9307 1199.4058 1203.8698 1214.5747 1232.2553 1276.5439 1285.4590 1290.6039 1368.2100 1372.4186 1398.1852 1404.5177 1405.2600 1421.7027 1423.7679 1455.6603 1455.7281 1470.6993 1471.0967 1479.7414 1484.8459 1513.8416 1528.9863 1566.9699 1583.4191 1588.3381 1610.9258 1613.5797 2992.2834 2992.5700 3077.5334 3078.1726 3094.0037 3094.2784 3124.1078 3124.3997 3129.5292 3129.8644 3145.2469 3145.4100 3165.2755 3165.3919 3490.5106 3503.1181
redmass: 3.7060 5.4677 5.5431 6.2568 6.6840 5.9200 2.0399 1.1041 1.3997 3.6361 3.9652 4.4501 4.2236 4.1054 4.9174 8.1608 4.7203 5.1579 5.1989 3.0720 3.4633 3.0962 3.2496 3.9195 4.4710 5.2929 4.7247 1.3865 1.0761 6.1626 5.8292 5.7271 3.1967 1.8811 1.7059 5.5008 1.9118 2.0661 4.9115 5.7201 1.3036 1.3062 5.2570 1.3876 1.3836 1.5835 1.5841 1.3441 1.3438 3.7361 1.6146 1.6124 2.2223 2.1964 3.0563 1.6945 1.6234 1.0694 1.0705 4.5382 2.1990 2.4179 1.7983 2.1426 1.4562 1.6281 5.8824 7.5575 2.9673 1.2444 1.3147 1.8930 1.8782 1.0728 1.0708 1.2363 1.2611 2.1386 2.4288 2.4913 8.7657 6.1902 6.5134 6.3233 6.1584 6.3468 1.0366 1.0365 1.0966 1.0966 1.1007 1.1006 1.0858 1.0857 1.0893 1.0893 1.0939 1.0939 1.1009 1.1009 1.0795 1.0791
irintensity: 0.0019 0.8537 2.2411 0.6117 3.6724 5.4555 2.6827 0.2596 0.5952 0.3105 6.0339 2.7531 27.6999 0.2272 1.3077 1.7327 7.7512 1.9624 6.4712 0.2551 14.3325 8.4107 11.3306 2.5614 3.6464 1.5432 16.2281 3.6336 199.8923 16.4387 5.6801 12.3019 4.2690 47.5748 31.6808 3.1761 37.6725 28.9249 0.7489 4.4760 0.0265 0.9808 0.0007 0.2441 1.7996 0.4185 0.4405 0.0370 0.0414 0.0767 9.0123 9.0640 10.9066 2.1931 37.3690 2.2253 1.2468 3.4134 0.2384 0.0012 5.4358 0.0196 9.5053 0.0720 19.0475 0.9947 93.1624 2.1813 820.9664 11.1474 125.0680 39.9871 1.2295 29.9685 9.2220 71.2269 24.7685 2.4388 64.0233 0.9751 299.8516 0.2358 32.4593 0.2049 35.3050 2.7626 20.9273 21.8041 18.1133 15.6818 29.0445 19.2160 8.7874 6.8170 3.1744 3.1763 31.0913 26.4285 43.8008 12.0930 0.6629 177.7041
temp: 298.150 k
press: 1.00000 atm
elementType: 8 8 7 7 6 6 6 6 6 6 6 6 6 6 6 6 6 6 6 6 1 1 1 1 1 1 1 1 1 1 1 1 1 1 1 1
symmnumber: 1
zpe: 747567.9 jmol-1
zpe.correction: 0.284734 hartree
zpe.thermalcorrener: 0.303345 hartree
zpe.thermalcorrenthalpy: 0.304289 hartree
zpe.thermalcorrgfe: 0.236106 hartree
zpe.sumelectzpe: -877.842983 hartree
zpe.sumelectthermal: -877.824372 hartree
zpe.sumelectthermalent: -877.823428 hartree
zpe.sumelectthermalfe: -877.891611 hartree
dipole: 0.0062 0.0046 0.3434
dipole: 0.3435
quadrupole: -89.1090 -121.1041 -116.2474
quadrupole: -10.0770 -0.0361 -0.0204
quadrupole: 19.7112 -12.2840 -7.4272 -10.0770 -0.0361 -0.0204
hfenergy: -878.127717 hartree
pointgroup: C01 [X(C16H16N2O2)]
dipole: -0.0072291 0.0452585 -0.1271493 debye
polarizability: 321.7902042|10.2440633|177.4254807|-4.0714755|18.3635068|128.7809779 unknown
InChI: InChI=1S/C16H16N2O2/c1-11-7-3-5-9-13(11)15(19)17-18-16(20)14-10-6-4-8-12(14)2/h3-10,17-18H,1-2H3
charge 0 multiplicity 1
36 atoms
O  -1.386978 1.857685 0.61765
O  1.339959 -1.821945 -0.732489
N  -0.681055 -0.237595 -0.005268
N  0.640942 0.203879 0.094817
C  -3.085171 0.106608 0.2116
C  3.045487 -0.14536 -0.10325
C  -4.176085 0.935508 -0.201331
C  4.086118 -0.520364 -1.011003
C  -1.695881 0.658928 0.293218
C  1.652999 -0.66596 -0.281596
C  -3.319363 -1.244956 0.587231
C  3.335681 0.69886 1.003868
C  -5.469281 0.355081 -0.240253
C  5.385904 -0.004911 -0.775744
C  -3.995577 2.388302 -0.601581
C  3.845182 -1.428138 -2.203055
C  -4.615309 -1.796942 0.544739
C  4.637481 1.193827 1.218947
C  -5.69632 -0.990493 0.124417
C  5.668156 0.841142 0.319644
H  -2.488254 -1.858904 0.953541
H  2.546084 0.939421 1.725435
H  -6.312704 0.976004 -0.563912
H  6.190394 -0.276144 -1.469242
H  -3.193382 2.511821 -1.350826
H  -4.93269 2.794115 -1.019818
H  -3.692749 3.000902 0.264849
H  4.743363 -1.474545 -2.842505
H  3.583176 -2.448518 -1.874825
H  2.99427 -1.083082 -2.817326
H  -0.766654 -1.183069 -0.394142
H  0.722196 1.193091 0.354292
H  -4.780107 -2.836819 0.845557
H  4.845906 1.835698 2.081259
H  -6.710419 -1.403483 0.086232
H  6.68608 1.21646 0.472469
