program: Gaussian 09
title: 000259543
version: EM64L-G09RevD.01
frameworkgroup: C1[X(C14H12N6O6)]
method: RPBEPBE
basis: SDD
operation: Freq
keyword: #p
keyword: freq=noraman
keyword: PBEPBE/SDD
title: #p freq=noraman PBEPBE/SDD
converged: YES YES NO NO
title: Mulliken charges:
elementType: O O O O O O N N N N N N C C C C C C C C C C C C C C H H H H H H H H H H H H
charge: -0.249948 -0.221005 -0.190570 -0.171802 -0.178355 -0.181381 -0.275308 0.002474 -0.068524 0.014254 0.017044 -0.063029 0.548455 0.138426 -0.098803 -0.517878 -0.575225 0.371877 0.377603 -0.218296 0.039739 0.177615 -0.351915 -0.224845 -0.505699 -0.672583 0.368879 0.282755 0.268381 0.256786 0.232906 0.233589 0.255989 0.243716 0.252132 0.212644 0.235211 0.234690
chargesum: 0.00000
title: Mulliken charges with hydrogens summed into heavy atoms:
elementType: O O O O O O N N N N N N C C C C C C C C C C C C C C
charge: -0.249948 -0.221005 -0.190570 -0.171802 -0.178355 -0.181381 -0.275308 0.002474 -0.068524 0.014254 0.017044 -0.063029 0.548455 0.138426 -0.098803 -0.148999 -0.292470 0.371877 0.377603 0.050085 0.039739 0.177615 -0.095129 0.241651 0.246137 0.009962
polarizability: 3.82947398e+02 -5.07363725e+00 2.42509781e+02 1.18726820e+01 3.14033527e+00 1.05855058e+02
1716.lowfreq: -4.2498 -0.0010 -0.0007 -0.0004 2.0442 7.5468 10.2825 27.6979 39.2962
frequency: 10.1234 27.6971 39.2948 48.4894 59.0975 63.6997 68.2118 95.7908 114.8459 118.8661 134.1418 151.1307 163.3057 178.7727 196.7502 211.8731 221.4562 238.1198 248.5220 264.9349 271.7997 302.4067 317.4118 330.6824 340.6365 352.6787 379.8241 431.9008 446.7133 498.2569 517.6631 553.2515 565.6717 589.6737 631.9752 637.0528 653.7451 660.8916 666.2714 683.8353 691.9892 720.2590 730.3031 736.2405 780.0193 788.2629 800.8304 810.0122 812.9530 824.3935 855.2132 869.1135 917.5857 929.5578 933.0546 974.9426 979.7370 1015.4857 1081.7531 1098.6673 1099.3149 1109.0065 1132.7574 1133.1673 1137.6369 1148.8575 1199.7748 1209.2063 1220.5298 1240.1683 1248.0055 1256.9716 1272.7193 1289.3486 1310.6261 1316.3196 1352.3435 1357.9360 1368.8533 1376.0546 1388.1857 1402.4045 1409.8570 1422.7039 1434.5238 1447.0857 1462.4411 1466.8196 1468.4585 1470.0860 1485.0800 1488.2320 1520.0134 1555.6850 1565.4211 1626.8699 2999.1199 3018.4447 3019.7409 3079.2059 3095.8682 3113.4033 3136.3041 3140.3238 3154.7002 3176.3572 3184.3477 3247.0757
redmass: 6.9124 4.8513 14.4392 6.6615 6.0841 6.8512 3.2300 2.8218 2.6034 1.4023 4.3890 9.2085 4.6731 7.0469 8.4781 3.3743 3.8281 1.7016 4.1114 8.0590 4.1311 8.1058 9.4391 3.7028 7.9723 6.9678 7.9359 7.3459 6.3377 7.9202 7.9088 3.8157 7.4146 6.0651 5.6079 4.7645 7.3556 7.8884 5.9321 9.1703 9.5422 8.2250 7.3504 9.2250 3.9445 5.0256 1.1008 5.2483 2.1624 7.4574 9.3083 10.4762 1.6641 1.4459 8.8922 1.4603 5.4295 2.4350 2.8945 1.4430 2.1524 4.4875 1.6675 3.2967 4.5080 1.3610 4.9402 2.9529 2.7973 5.0566 1.1393 2.7554 4.5229 3.3170 4.4805 3.1871 1.6980 4.3273 3.0030 10.8820 10.0088 1.2961 1.8767 1.4657 4.5997 3.7203 1.0394 1.0722 1.0585 1.0851 1.0889 3.8977 8.2130 9.1579 9.9425 6.7234 1.0361 1.0582 1.0270 1.1066 1.0984 1.1031 1.0949 1.1069 1.1053 1.0927 1.0919 1.0979
irintensity: 0.0293 0.3387 0.1591 0.9540 0.1755 0.9893 1.7270 8.9552 0.8232 1.8698 0.2486 1.3061 1.6713 1.9141 3.3707 8.7887 6.5958 0.9832 1.9279 2.0944 2.7584 2.2746 2.4645 7.1459 0.0349 3.8306 1.9665 0.4478 0.2716 9.0897 0.6851 2.1161 11.8131 10.6902 28.0510 15.7332 9.6701 13.8327 20.5477 21.9253 35.7025 1.3886 2.0860 7.5688 17.1621 45.4543 3.2598 6.0982 5.2833 25.9466 12.0266 14.5265 22.1658 13.0361 73.9665 26.6195 51.2601 115.0776 164.3756 1.2467 1.0024 6.0981 12.7561 41.0580 77.3852 6.5942 173.0039 7.6006 177.6547 187.3969 0.0614 45.6230 89.2958 529.1206 17.7287 142.1534 4.2209 18.5829 62.5129 33.7634 75.9252 81.4686 29.3783 56.9039 7.7775 11.1675 12.6779 4.0588 13.7370 24.2407 25.9176 723.7036 60.7996 36.3512 361.3362 32.1700 22.1920 19.1559 58.5342 4.6682 26.8281 39.7036 78.8797 6.0327 11.5521 7.4845 6.9525 1.6722
temp: 298.150 k
press: 1.00000 atm
elementType: 8 8 8 8 8 8 7 7 7 7 7 7 6 6 6 6 6 6 6 6 6 6 6 6 6 6 1 1 1 1 1 1 1 1 1 1 1 1
symmnumber: 1
zpe: 691418.8 jmol-1
zpe.correction: 0.263348 hartree
zpe.thermalcorrener: 0.286612 hartree
zpe.thermalcorrenthalpy: 0.287557 hartree
zpe.thermalcorrgfe: 0.207613 hartree
zpe.sumelectzpe: -1318.466192 hartree
zpe.sumelectthermal: -1318.442928 hartree
zpe.sumelectthermalent: -1318.441983 hartree
zpe.sumelectthermalfe: -1318.521927 hartree
dipole: -3.5220 0.1115 1.9063
dipole: 4.0064
quadrupole: -134.7656 -172.9886 -148.5102
quadrupole: -3.7110 6.0470 1.1456
quadrupole: 17.3226 -20.9004 3.5779 -3.7110 6.0470 1.1456
hfenergy: -1318.7295399 hartree
pointgroup: C01 [X(C14H12N6O6)]
dipole: 1.3998135 0.1210829 -0.7143797 debye
polarizability: 382.2745093|4.6818995|241.9987234|17.8715447|9.5123398|107.0390042 unknown
InChI: InChI=1S/C14H12N6O6/c1-3-26-14-11-13(15-6-16-14)18(7-17-11)8-4-9(19(21)22)12(25-2)10(5-8)20(23)24/h4-7H,3H2,1-2H3
charge 0 multiplicity 1
38 atoms
O  -4.76032 0.330679 0.215117
O  5.483028 -0.531569 -0.036893
O  -3.310115 -3.57028 0.089676
O  -2.16918 3.20432 1.196844
O  -4.95779 -2.271347 -0.796467
O  -3.838784 2.952614 -0.336642
N  0.819215 -0.747991 -0.015698
N  2.774194 -1.976058 -0.056344
N  1.817261 1.543561 0.053141
N  -3.783936 -2.431135 -0.294748
N  -2.850748 2.504663 0.357634
N  4.261986 1.497548 0.034709
C  -0.582051 -0.475686 -0.009649
C  1.881814 0.182778 0.008982
C  3.074235 -0.60035 -0.020812
C  -1.055616 0.846318 0.167646
C  -1.515637 -1.521205 -0.166132
C  -2.896058 -1.24713 -0.164695
C  -2.437306 1.09086 0.155263
C  1.439453 -2.025716 -0.051864
C  -3.424954 0.072374 -0.009485
C  4.294514 0.133841 -0.007587
C  3.048647 2.127585 0.062842
C  6.740469 0.289753 -0.019186
C  -5.682809 0.616782 -0.925391
C  7.89366 -0.70525 -0.053779
H  -0.347107 1.669825 0.305613
H  -1.217812 -2.566166 -0.278027
H  0.869443 -2.950515 -0.060026
H  3.070045 3.219833 0.099298
H  6.724546 0.96226 -0.894936
H  6.73335 0.910332 0.894185
H  -5.364198 1.549334 -1.415902
H  -6.66371 0.744046 -0.446798
H  -5.697934 -0.242716 -1.612349
H  8.854029 -0.158385 -0.040935
H  7.862806 -1.376366 0.821064
H  7.856072 -1.322543 -0.967172
