program: Gaussian 09
title: 000259509
version: EM64L-G09RevD.01
frameworkgroup: C1[X(C14H14ClNS)]
method: RPBEPBE
basis: SDD
operation: Freq
keyword: #p
keyword: freq=noraman
keyword: PBEPBE/SDD
title: #p freq=noraman PBEPBE/SDD
converged: YES YES NO NO
title: Mulliken charges:
elementType: Cl S N C C C C C C C C C C C C C C H H H H H H H H H H H H H H
charge: -0.066034 0.201779 -0.300722 -0.474421 0.427133 -0.651099 -0.378135 -0.430870 -0.205341 -0.222218 -0.220976 -0.240450 -0.240566 -0.142230 -0.205168 -0.226638 -0.095905 0.229515 0.207013 0.281063 0.269819 0.250775 0.259287 0.231364 0.227819 0.227007 0.229843 0.251093 0.294894 0.256895 0.255474
chargesum: 0.00000
title: Mulliken charges with hydrogens summed into heavy atoms:
elementType: Cl S N C C C C C C C C C C C C C C
charge: -0.066034 0.201779 -0.019659 -0.037893 0.427133 -0.130505 -0.118848 -0.199505 -0.205341 0.005601 0.006030 -0.010607 0.010527 0.152664 0.051727 0.028836 -0.095905
polarizability: 2.50846656e+02 1.46804708e+01 1.96434462e+02 1.13700427e+01 5.96314245e+00 1.02144993e+02
1716.lowfreq: -0.0023 -0.0023 -0.0022 2.3562 6.0559 8.9558 15.0347 23.5068 33.1105
frequency: 14.7984 23.4576 33.1053 46.8865 79.0874 92.8914 131.3410 165.9612 177.2025 225.0642 261.8775 270.9789 292.3199 311.5418 360.4243 404.8887 409.1650 433.7140 478.4008 487.4439 497.4258 576.7768 616.4628 620.8343 681.8753 694.0614 701.1403 710.4048 713.6040 748.0957 816.2705 818.4250 840.1519 857.9643 904.7974 920.3402 947.5742 964.6841 979.4576 981.6963 989.8488 991.5378 998.3390 1025.8842 1061.9787 1067.9061 1072.3755 1081.6798 1104.3190 1129.3140 1171.3885 1174.3489 1182.9517 1184.0882 1211.9423 1246.4100 1275.2779 1290.1855 1314.6274 1351.6948 1358.3197 1386.2522 1389.1143 1436.7163 1441.9103 1456.8387 1460.6866 1479.7408 1488.3357 1575.5498 1579.0186 1594.6756 1615.5277 2879.1261 2917.8187 2966.2336 3047.0233 3114.2190 3126.0414 3127.7633 3138.8190 3144.1107 3150.7669 3164.3093 3165.3586 3173.5235 3455.7008
redmass: 5.4059 4.7234 3.8619 4.0643 5.4351 7.3279 3.8693 3.0612 4.5746 3.4731 4.0646 6.0614 7.4894 10.5851 4.8968 2.8411 3.0037 3.5723 3.2609 3.9400 6.7151 5.0056 6.4239 7.0632 2.2409 4.1810 2.3851 5.1002 1.8503 1.5202 1.6933 2.3929 1.3050 1.2471 1.4270 1.4646 1.3296 2.0589 1.3612 1.3777 5.5514 5.3798 1.3341 2.1676 2.2499 7.1966 1.8994 1.6380 1.3717 4.6513 1.0586 1.0706 1.1054 1.1299 2.5212 1.2474 1.1851 1.2421 1.3234 1.6805 4.2991 4.1638 3.9789 1.3824 1.7663 1.9102 1.1479 1.6344 1.3562 7.8858 6.1123 6.1359 6.1419 1.0696 1.0679 1.0882 1.0934 1.0874 1.0863 1.0918 1.0916 1.0894 1.0953 1.1013 1.0947 1.0964 1.0751
irintensity: 0.0427 0.0765 0.1882 0.6392 2.0531 0.1121 1.5654 6.3112 2.2932 3.7153 0.1481 2.1907 0.5447 0.2960 2.1386 0.1538 0.3040 3.0360 25.6673 9.6870 26.9482 4.3082 0.4230 0.4581 77.5023 1.1352 23.9577 9.1730 44.3730 69.5136 22.5686 30.4650 31.1293 0.5658 6.1992 0.1987 0.2244 19.3964 1.1241 1.9658 2.7036 65.9952 0.7872 15.2238 4.3045 2.9471 63.8127 6.2430 7.4391 95.6383 0.5052 10.1028 0.6383 1.0519 4.5167 4.7040 29.2543 4.2886 6.8409 1.7279 1.6815 0.9884 4.4848 21.5053 50.6602 95.7841 43.9119 24.3052 3.1099 1.8361 0.9451 0.3972 7.3974 90.4593 88.0359 26.0321 15.5280 8.8143 0.3905 13.1061 18.9932 3.2850 35.9764 19.5723 4.1352 4.9076 2.4264
temp: 298.150 k
press: 1.00000 atm
elementType: 17 16 7 6 6 6 6 6 6 6 6 6 6 6 6 6 6 1 1 1 1 1 1 1 1 1 1 1 1 1 1
symmnumber: 1
zpe: 634333.0 jmol-1
zpe.correction: 0.241605 hartree
zpe.thermalcorrener: 0.257788 hartree
zpe.thermalcorrenthalpy: 0.258733 hartree
zpe.thermalcorrgfe: 0.193953 hartree
zpe.sumelectzpe: -1453.523367 hartree
zpe.sumelectthermal: -1453.507184 hartree
zpe.sumelectthermalent: -1453.506240 hartree
zpe.sumelectthermalfe: -1453.571019 hartree
dipole: 3.0961 1.5651 0.7638
dipole: 3.5523
quadrupole: -109.7583 -112.6152 -116.6115
quadrupole: -4.7012 3.5781 4.6983
quadrupole: 3.2367 0.3798 -3.6165 -4.7012 3.5781 4.6983
hfenergy: -1453.7649721 hartree
pointgroup: C01 [X(C14H14Cl1N1S1)]
dipole: -1.1994245 0.6609281 -0.2789548 debye
polarizability: 249.627032|-18.5149635|195.8271229|0.3877174|-16.5356466|103.9719558 unknown
InChI: InChI=1S/C14H14ClNS/c15-13-6-8-14(9-7-13)17-11-16-10-12-4-2-1-3-5-12/h1-9,16H,10-11H2
charge 0 multiplicity 1
31 atoms
Cl 5.058476 -2.779422 -0.479376
S  1.664814 2.699139 0.103769
N  -0.869342 1.535669 -0.154571
C  -2.086544 1.176455 -0.920524
C  -2.995158 0.230479 -0.141597
C  0.083177 2.376589 -0.882011
C  -2.458021 -0.764043 0.714639
C  -4.401942 0.316676 -0.292463
C  2.573916 1.110744 -0.086567
C  -3.311343 -1.657339 1.400201
C  -5.257049 -0.580664 0.386682
C  -4.713659 -1.571943 1.236135
C  3.988203 1.162126 -0.016325
C  1.916973 -0.130384 -0.266475
C  4.748889 -0.023215 -0.126337
C  2.673787 -1.316963 -0.398255
C  4.077902 -1.245984 -0.322186
H  -1.748956 0.682753 -1.856594
H  -2.678774 2.069136 -1.237736
H  -1.08082 1.897726 0.784764
H  0.362098 1.882711 -1.829978
H  -0.275806 3.405231 -1.112892
H  -1.371849 -0.82208 0.843462
H  -4.830826 1.08931 -0.943272
H  -2.883152 -2.419505 2.061231
H  -6.342643 -0.502056 0.259098
H  -5.374817 -2.265534 1.767581
H  4.500597 2.121566 0.111556
H  0.82168 -0.160714 -0.281274
H  5.840731 0.011242 -0.073153
H  2.173059 -2.279003 -0.542635
