program: Gaussian 09
title: 000259502
version: EM64L-G09RevD.01
frameworkgroup: C1[X(C12H15Cl2NO)]
method: RPBEPBE
basis: SDD
operation: Freq
keyword: #p
keyword: freq=noraman
keyword: PBEPBE/SDD
title: #p freq=noraman PBEPBE/SDD
converged: YES YES NO NO
title: Mulliken charges:
elementType: Cl Cl O N C C C C C C C C C C C C H H H H H H H H H H H H H H H
charge: -0.029078 -0.062741 -0.248438 -0.062058 -0.400043 -0.381789 -0.371333 -0.364644 -0.379351 -0.359139 0.484666 -0.283228 -0.270879 -0.206833 -0.239241 -0.103574 0.190300 0.222201 0.213039 0.197899 0.195792 0.210173 0.239290 0.191026 0.201593 0.195355 0.235206 0.211886 0.241238 0.279235 0.253471
chargesum: 0.00000
title: Mulliken charges with hydrogens summed into heavy atoms:
elementType: Cl Cl O N C C C C C C C C C C C C
charge: -0.029078 -0.062741 -0.248438 -0.062058 0.012458 0.029149 0.034632 0.065672 0.017597 0.087953 0.484666 -0.283228 -0.029641 0.072402 0.014230 -0.103574
polarizability: 1.92214235e+02 1.40850992e+01 1.71232950e+02 -1.68962008e+01 7.93413929e+00 1.09186651e+02
1716.lowfreq: -9.6079 -4.1428 -0.0013 0.0020 0.0025 9.5856 20.0309 30.9665 42.9508
frequency: 16.1381 30.4453 42.4263 77.1581 113.0522 144.9988 163.7468 173.4875 204.8558 230.3954 242.9019 327.0525 343.9931 359.6995 373.5796 379.9049 388.8493 433.8904 439.0375 448.7953 537.1419 544.5590 591.1551 620.4901 673.8763 697.0553 757.0970 775.3763 787.0300 806.2707 841.4891 849.0099 860.2996 861.5750 906.4902 916.6428 954.0988 996.5855 1021.5000 1031.0950 1045.6455 1083.4371 1100.2020 1106.8562 1133.1011 1144.4526 1154.7578 1182.9675 1209.4431 1222.9626 1247.3213 1260.3513 1269.4497 1304.8848 1331.6096 1337.5828 1342.9012 1348.4311 1353.2638 1359.5489 1378.1450 1388.1261 1394.2224 1451.1251 1457.0569 1461.3807 1464.6698 1465.4001 1473.6429 1484.4876 1566.7315 1590.2783 2871.8231 2876.8503 2967.1053 2975.2175 2984.4791 2990.3491 3014.6492 3038.4293 3042.1781 3048.7692 3053.8080 3059.5936 3165.4956 3180.8772 3191.9973
redmass: 5.1030 5.0165 3.7731 4.8541 5.6730 5.0173 5.9569 12.4772 4.1863 2.8828 2.0678 6.9107 3.9780 2.4804 3.4208 4.5133 3.4376 3.1853 3.0907 3.3658 1.8000 3.9439 5.1522 5.8704 6.7301 3.4689 3.6166 7.5576 1.6014 1.4760 1.9601 2.9173 1.3782 2.5723 2.4803 1.3572 1.3081 2.4835 3.2593 2.1189 2.0167 2.3808 1.3850 2.0781 2.0220 1.3175 1.2711 2.1004 1.3827 2.3963 1.3451 1.2671 1.1872 1.7581 1.3410 1.6492 1.4544 1.9220 1.5230 1.8005 1.6878 4.8731 1.3750 1.0965 2.6689 1.0954 1.0882 1.0910 1.0926 1.1005 7.9010 7.6331 1.0705 1.0701 1.0640 1.0572 1.0617 1.0609 1.0883 1.0960 1.1067 1.1026 1.0947 1.1015 1.0895 1.0932 1.0945
irintensity: 0.0317 0.0511 0.2509 0.1753 0.2935 1.6780 0.1666 4.6045 1.9732 6.6795 0.8251 0.7714 8.9402 1.0672 4.6633 1.7439 4.4734 11.6201 3.8253 0.6998 0.1281 6.3276 2.0062 31.2860 30.4455 1.1500 5.6494 121.3622 53.1649 0.0009 68.9593 45.6930 22.4353 112.3186 44.3309 0.3976 3.6138 63.4989 32.3645 59.6383 3.5006 36.5529 0.1068 40.7970 5.2725 3.2230 3.4838 133.6165 60.8422 69.6459 35.4136 3.6321 3.0968 21.9628 5.2192 20.5273 3.1753 33.4792 9.5784 5.6732 33.6433 1.6044 3.9233 10.3430 230.6509 6.2368 8.5348 6.7028 4.4523 17.4836 21.7695 6.4983 44.1468 178.2330 40.5794 83.8337 23.8503 28.7582 57.6064 49.3786 19.8690 37.3921 25.2681 85.1802 2.2325 0.0358 7.0782
temp: 298.150 k
press: 1.00000 atm
elementType: 17 17 8 7 6 6 6 6 6 6 6 6 6 6 6 6 1 1 1 1 1 1 1 1 1 1 1 1 1 1 1
symmnumber: 1
zpe: 649209.2 jmol-1
zpe.correction: 0.247271 hartree
zpe.thermalcorrener: 0.262759 hartree
zpe.thermalcorrenthalpy: 0.263703 hartree
zpe.thermalcorrgfe: 0.201948 hartree
zpe.sumelectzpe: -1515.136972 hartree
zpe.sumelectthermal: -1515.121483 hartree
zpe.sumelectthermalent: -1515.120539 hartree
zpe.sumelectthermalfe: -1515.182294 hartree
dipole: 4.9048 -1.5988 -1.2170
dipole: 5.3004
quadrupole: -106.0917 -113.0006 -106.3408
quadrupole: -2.2934 -2.4672 2.2677
quadrupole: 2.3860 -4.5229 2.1369 -2.2934 -2.4672 2.2677
hfenergy: -1515.3842423 hartree
pointgroup: C01 [X(C12H15Cl2N1O1)]
dipole: -1.8765969 -0.8108815 -0.4115925 debye
polarizability: 184.5835012|24.8731516|118.0924065|-19.8764543|13.2726695|169.9579276 unknown
InChI: InChI=1S/C12H15Cl2NO/c13-10-4-5-12(11(14)8-10)16-9-15-6-2-1-3-7-15/h4-5,8H,1-3,6-7,9H2
charge 0 multiplicity 1
31 atoms
Cl 2.0714 1.261854 2.845593
Cl 4.218657 0.603551 -2.233581
O  -0.026678 -0.593386 1.896185
N  -2.166021 -0.797577 0.700778
C  -4.085984 0.499798 -1.065673
C  -3.415285 1.266787 0.098821
C  -3.162284 -0.634628 -1.569696
C  -3.00411 0.299976 1.229669
C  -2.768865 -1.56888 -0.404422
C  -1.261719 -1.426693 1.605113
C  0.890572 -0.349267 0.880721
C  1.97666 0.515397 1.193747
C  0.847539 -0.908276 -0.424142
C  2.990533 0.808926 0.265287
C  1.855806 -0.626471 -1.372274
C  2.913203 0.227663 -1.015642
H  -5.045472 0.064041 -0.716034
H  -4.330194 1.192177 -1.892791
H  -2.509849 1.784321 -0.272018
H  -4.099855 2.035952 0.504571
H  -3.664375 -1.223823 -2.361048
H  -2.242757 -0.196067 -2.003556
H  -2.421185 0.83818 1.997501
H  -3.922947 -0.107476 1.72021
H  -3.681137 -2.116584 -0.061252
H  -2.046053 -2.333482 -0.749193
H  -1.638998 -1.531189 2.641455
H  -0.947564 -2.414398 1.21692
H  0.020407 -1.55826 -0.714374
H  3.815044 1.471662 0.539048
H  1.810008 -1.065326 -2.372823
