program: Gaussian 09
title: 000259539
version: EM64L-G09RevD.01
frameworkgroup: C1[X(C23H28N2O)]
method: RPBEPBE
basis: SDD
operation: Freq
keyword: #p
keyword: freq=noraman
keyword: PBEPBE/SDD
title: #p freq=noraman PBEPBE/SDD
converged: YES YES NO NO
title: Mulliken charges:
elementType: O N N C C C C C C C C C C C C C C C C C C C C C C C H H H H H H H H H H H H H H H H H H H H H H H H H H H H
charge: -0.269387 -0.109836 -0.365479 -0.401997 0.253219 0.422050 0.333158 -0.328413 -0.324557 -0.294689 -0.412020 -0.417794 0.323557 -0.490878 0.379550 -0.442851 -0.792452 -0.670669 -0.670486 -0.403385 -0.186781 -0.412388 -0.356961 -0.234686 -0.244287 -0.251168 0.222611 0.215597 0.206526 0.191425 0.205303 0.189448 0.235919 0.207983 0.252218 0.247252 0.286467 0.260826 0.228908 0.241985 0.238103 0.208262 0.227590 0.208579 0.207009 0.229184 0.210639 0.253439 0.229250 0.240882 0.253128 0.221529 0.223557 0.226011
chargesum: 0.00000
title: Mulliken charges with hydrogens summed into heavy atoms:
elementType: O N N C C C C C C C C C C C C C C C C C C C C C C C
charge: -0.269387 -0.109836 -0.365479 0.036210 0.253219 0.422050 0.333158 0.069537 0.070194 0.149212 -0.159802 -0.170541 0.323557 -0.204411 0.379550 -0.182025 -0.083456 -0.026239 -0.023654 -0.149946 0.042468 -0.171506 -0.103833 -0.013157 -0.020729 -0.025157
polarizability: 2.74519584e+02 4.25972704e+01 2.82982796e+02 -3.26259951e+01 5.76802689e+00 2.59816703e+02
1716.lowfreq: -3.8199 -0.0005 0.0006 0.0007 3.0453 7.0163 12.4779 16.8153 29.1008
frequency: 12.2693 16.4580 29.0294 38.1028 46.3467 58.7387 72.7885 74.0693 83.6090 89.6621 107.0310 123.4725 138.1193 151.7129 171.4395 184.6213 201.3732 228.9919 235.4782 251.9097 255.4068 264.7036 292.2268 309.0487 315.0376 317.6870 349.9826 394.5800 408.0600 410.8868 436.5693 455.7162 470.1784 485.8228 514.1078 527.6586 574.5178 606.7876 613.6720 625.6595 640.7704 663.3813 677.9249 691.3081 701.9534 720.4676 747.4590 763.3662 780.1494 793.7624 795.7194 796.1042 814.7367 848.1645 849.6748 855.5683 872.7071 892.6806 913.9687 917.4198 925.0897 964.4751 970.8727 973.6897 976.7175 986.1290 986.6598 990.5163 991.7574 1025.2685 1031.1929 1042.5626 1053.1471 1063.0624 1064.6029 1077.0581 1078.7308 1081.4218 1085.3485 1094.8471 1097.6510 1124.0476 1163.9161 1166.3720 1170.8320 1192.8079 1194.1540 1207.8368 1217.6431 1238.5477 1277.5068 1281.4172 1288.7458 1291.9002 1294.4181 1308.9390 1324.0231 1332.9183 1343.2018 1362.5301 1365.7730 1367.3352 1383.8838 1389.2641 1389.4631 1392.2030 1395.2849 1407.6111 1435.5481 1438.6825 1461.5854 1462.5285 1463.5038 1468.6529 1470.6110 1471.7774 1476.1194 1480.6097 1483.7688 1486.5245 1489.6942 1493.2971 1526.2978 1562.7140 1580.4977 1597.1266 1607.5565 1613.4059 2854.9670 2863.9220 2913.1307 2968.9709 2973.6866 2983.2000 2984.9218 3017.9572 3035.2390 3036.9326 3045.7519 3062.4487 3075.6597 3077.3528 3091.6421 3092.3800 3092.6935 3120.8430 3128.8923 3138.7843 3143.5891 3153.7102 3161.8784 3165.6849 3173.3322 3177.4101 3203.2121 3224.1400
redmass: 4.3303 3.6244 4.3039 4.0235 3.7462 4.3481 3.6063 2.7245 3.7965 2.0216 2.9548 2.9066 1.1847 2.7419 1.9436 2.0681 2.0788 1.7869 3.5279 3.1322 3.8298 2.6479 2.1525 4.5414 2.7571 4.5066 3.4223 3.5293 2.9247 4.1780 2.9858 3.2816 2.7264 3.6812 3.7280 3.5773 6.2411 4.3352 6.0493 3.9132 5.1377 4.4208 5.5540 2.6668 1.8728 3.5171 2.7631 1.5641 1.4472 1.3150 1.1604 1.2504 1.2648 1.2713 1.3760 5.0122 1.5371 1.4127 1.5224 1.8712 4.6739 7.0555 1.3501 1.4290 1.6560 5.2002 5.4635 1.3203 2.2176 2.2137 1.7561 1.4495 1.5752 2.6425 1.6597 1.9348 1.7523 1.6171 2.1508 2.6951 2.2418 1.7130 1.3593 1.1731 1.0551 1.1877 2.0690 2.2465 1.7486 1.6562 2.5653 1.2268 1.2534 1.2368 1.4045 1.9056 2.4030 1.4688 3.7564 1.3548 2.3117 1.7217 3.3408 1.2425 1.2577 3.4577 2.1281 1.2538 2.7739 2.8575 1.0655 1.0842 1.0554 2.1942 1.0864 1.1572 1.2125 1.1909 1.4288 1.1005 1.2250 1.0896 5.4745 5.2059 6.0679 6.7894 6.5512 6.1149 1.0719 1.0715 1.0701 1.0573 1.0384 1.0358 1.0358 1.0878 1.0983 1.0892 1.0973 1.0973 1.0983 1.0980 1.0971 1.1004 1.1004 1.0843 1.0878 1.0870 1.0931 1.0956 1.0927 1.1006 1.0968 1.0933 1.0921 1.1037
irintensity: 0.1102 0.0951 0.0460 0.0322 0.1216 0.6127 1.0427 0.6624 0.3212 0.4887 0.5987 0.8180 0.1497 1.6446 1.1243 0.6343 0.4637 0.6165 1.0502 0.8212 1.3747 3.7780 3.2188 0.2365 1.4230 1.4007 0.7749 3.5131 0.2428 1.0594 2.7984 3.7898 5.3454 8.4198 3.0863 9.2672 9.4281 0.3947 0.3161 2.5583 3.7424 2.0901 3.0692 14.0880 49.2350 20.2719 6.7692 103.7854 19.0408 29.6105 9.0634 23.8815 9.2366 0.4336 0.1135 23.3550 22.2421 0.1103 7.6838 0.7251 0.9974 91.0293 0.8218 0.9713 2.3576 13.3684 4.4523 1.0104 5.6205 8.2405 8.7376 6.1834 19.3152 30.0712 25.3817 16.0981 15.0142 2.7716 2.9265 15.9484 6.1223 8.1021 23.7197 17.0496 0.1148 26.0384 123.9322 38.9470 46.9430 19.4003 65.0839 6.7678 4.4827 24.4710 0.4821 2.1607 11.8247 1.7549 10.4691 1.4781 9.6479 9.7415 6.2946 21.7711 18.7553 44.3846 20.0970 4.3448 13.7401 50.2683 6.1224 18.2189 9.6103 25.0370 6.6046 31.3029 8.0940 32.0986 64.2967 11.8157 2.2279 13.9614 74.5416 9.4661 0.9300 71.3698 165.4139 46.7355 33.5648 181.2948 70.9861 27.6023 50.6195 28.7003 27.7624 20.6861 12.3110 12.9380 18.1993 36.4709 44.0850 75.4924 22.8481 23.2766 58.0622 3.9338 4.0261 10.9082 25.0136 33.7098 8.7880 15.2593 11.2481 0.3637 9.4783 4.5227
temp: 298.150 k
press: 1.00000 atm
elementType: 8 7 7 6 6 6 6 6 6 6 6 6 6 6 6 6 6 6 6 6 6 6 6 6 6 6 1 1 1 1 1 1 1 1 1 1 1 1 1 1 1 1 1 1 1 1 1 1 1 1 1 1 1 1
symmnumber: 1
zpe: 1191163.8 jmol-1
zpe.correction: 0.453690 hartree
zpe.thermalcorrener: 0.479598 hartree
zpe.thermalcorrenthalpy: 0.480542 hartree
zpe.thermalcorrgfe: 0.394657 hartree
zpe.sumelectzpe: -1076.036586 hartree
zpe.sumelectthermal: -1076.010679 hartree
zpe.sumelectthermalent: -1076.009735 hartree
zpe.sumelectthermalfe: -1076.095620 hartree
dipole: 2.2998 -1.3199 -0.0292
dipole: 2.6518
quadrupole: -146.8566 -150.5433 -149.6409
quadrupole: 8.7574 1.9586 0.6983
quadrupole: 2.1570 -1.5297 -0.6273 8.7574 1.9586 0.6983
hfenergy: -1076.4902764 hartree
pointgroup: C01 [X(C23H28N2O1)]
dipole: -0.9472935 -0.4336227 0.0555478 debye
polarizability: 265.7216287|-43.1040267|290.1682786|-30.6132697|-3.7685327|261.4291751 unknown
InChI: InChI=1S/C23H28N2O/c1-4-24(5-2)16-17-26-22-13-9-12-21(18-22)25-19(3)14-15-23(25)20-10-7-6-8-11-20/h6-15,18H,4-5,16-17H2,1-3H3
charge 0 multiplicity 1
54 atoms
O  -1.873521 -1.473061 1.427254
N  -4.729929 0.071209 -0.415907
N  2.589558 -0.838404 -0.612154
C  -3.998601 -0.593928 0.690508
C  2.666083 0.524661 -1.00956
C  1.742475 -1.375497 0.424994
C  3.316017 -1.633807 -1.527022
C  -5.160029 -0.887071 -1.471198
C  -5.819067 0.970367 0.048554
C  -2.501465 -0.663512 0.361878
C  3.45638 0.564806 -2.171291
C  3.859243 -0.772846 -2.489915
C  2.089371 1.661129 -0.270134
C  0.348051 -1.138715 0.362801
C  -0.487497 -1.656556 1.380996
C  2.303611 -2.133808 1.476207
C  3.38115 -3.133137 -1.443721
C  -5.337947 -0.228583 -2.852523
C  -5.289673 2.286183 0.649381
C  0.063768 -2.424714 2.439102
C  1.45073 -2.660446 2.475546
C  1.662269 2.810867 -0.997418
C  1.978665 1.690685 1.150636
C  1.149604 3.944331 -0.33361
C  1.454025 2.821533 1.811478
C  1.036396 3.956021 1.076918
H  -4.127133 -0.017758 1.623264
H  -4.375619 -1.623047 0.894416
H  -4.380375 -1.668018 -1.553371
H  -6.10256 -1.416711 -1.179023
H  -6.448959 1.213257 -0.826194
H  -6.486333 0.456558 0.786254
H  -2.061827 0.352159 0.341553
H  -2.332542 -1.146541 -0.622126
H  3.757947 1.475701 -2.686466
H  4.480512 -1.087136 -3.327521
H  -0.050529 -0.550539 -0.46742
H  3.385655 -2.28809 1.52009
H  3.998529 -3.490697 -0.597862
H  2.379764 -3.588386 -1.327413
H  3.828587 -3.525764 -2.371973
H  -5.621161 -0.986665 -3.606488
H  -4.39617 0.252323 -3.16923
H  -6.127999 0.543869 -2.844483
H  -6.12959 2.937618 0.955419
H  -4.676235 2.822237 -0.09537
H  -4.66237 2.109715 1.542274
H  -0.606701 -2.815843 3.210089
H  1.876056 -3.248286 3.296041
H  1.7198 2.798889 -2.091652
H  2.32138 0.835671 1.741443
H  0.827268 4.814362 -0.91731
H  1.381201 2.819993 2.905142
H  0.631336 4.833121 1.593718
