program: Gaussian 09
title: 000259491
version: EM64L-G09RevD.01
frameworkgroup: C1[X(C18H20N2O)]
method: RPBEPBE
basis: SDD
operation: Freq
keyword: #p
keyword: freq=noraman
keyword: PBEPBE/SDD
title: #p freq=noraman PBEPBE/SDD
converged: YES YES NO NO
title: Mulliken charges:
elementType: O N N C C C C C C C C C C C C C C C C C C H H H H H H H H H H H H H H H H H H H H
charge: -0.277562 -0.190769 -0.137758 -0.395421 -0.382683 -0.400995 -0.402104 0.291204 0.129590 0.302486 -0.346887 0.263771 -0.372697 -0.828767 -0.252575 -0.251742 -0.373830 -0.338349 -0.222599 -0.241116 -0.228787 0.192303 0.238800 0.229094 0.231791 0.216230 0.247627 0.257889 0.225605 0.239861 0.227654 0.243077 0.223547 0.228331 0.222985 0.225686 0.264584 0.249524 0.230930 0.230322 0.231749
chargesum: 0.00000
title: Mulliken charges with hydrogens summed into heavy atoms:
elementType: O N N C C C C C C C C C C C C C C C C C C
charge: -0.277562 -0.190769 -0.137758 0.035682 0.078202 0.062862 0.081390 0.291204 0.129590 0.302486 -0.107026 0.263771 -0.145043 -0.133812 -0.029589 -0.026056 -0.109246 -0.088825 0.008331 -0.010794 0.002962
polarizability: 2.96306027e+02 -1.74264478e+01 1.81784731e+02 -3.59076891e+00 7.46710841e+00 1.58901151e+02
1716.lowfreq: -18.8723 -4.8894 -0.0006 0.0001 0.0005 6.4173 22.1168 39.0808 46.2226
frequency: 20.8953 39.0541 46.2169 70.1375 81.1558 89.5493 104.8839 168.8626 186.3290 200.6104 220.0252 240.1299 267.2296 298.8023 316.6122 321.7026 345.7300 382.0285 405.1377 410.9784 449.9134 456.1908 468.7002 482.6561 537.0349 549.8465 570.5066 611.6941 615.1810 626.9947 687.6878 699.2548 702.7615 708.2924 724.1234 761.1815 787.0874 791.0269 842.5115 854.6965 860.5336 861.5736 923.4290 933.0370 936.5991 960.8687 975.2479 980.3755 982.7365 989.8475 1000.5042 1005.4040 1028.7144 1039.8434 1043.9462 1048.1049 1051.7850 1079.9668 1084.6646 1114.4134 1144.7016 1154.6093 1173.2361 1173.4702 1187.6544 1197.2133 1201.8838 1205.0730 1226.8640 1258.9444 1274.4199 1292.3230 1316.2675 1333.9855 1337.9046 1344.3582 1362.5142 1365.4485 1376.6468 1379.9367 1390.9031 1410.8224 1431.8971 1432.9331 1448.8555 1458.3180 1460.2731 1463.0932 1467.9340 1481.2670 1488.2386 1491.5419 1550.1434 1582.2097 1589.9057 1609.4810 1609.5916 2877.0175 2909.5698 2964.6821 2981.7047 2987.2914 3043.9457 3053.0567 3081.8426 3091.4337 3094.1816 3099.0431 3115.4400 3124.9018 3126.8829 3133.2996 3144.9575 3145.0829 3156.4314 3161.4694 3168.2931
redmass: 4.6942 4.2619 5.5116 4.2381 4.9256 3.4317 4.4085 3.4265 5.1969 1.0730 3.2985 3.3506 3.3594 3.3594 2.7471 3.0560 3.7990 2.7974 2.7755 2.9418 2.8364 3.1727 3.1144 3.8796 4.9251 3.5338 4.2090 6.2911 6.2064 2.8033 4.3767 3.6475 5.6968 1.5784 2.3121 1.5528 2.2674 4.5493 1.5705 1.4178 1.2708 3.2536 3.4499 1.4284 1.4552 2.3543 1.3232 1.5543 1.3913 5.7782 1.3390 2.9021 2.2238 2.3820 1.5533 1.7405 2.0947 1.8804 1.8968 1.9388 3.2669 2.3455 1.0545 1.0695 1.1173 1.8371 1.3721 3.0967 1.7550 1.7465 1.5663 1.4654 1.3288 1.6743 1.3913 1.3102 1.7024 1.5245 2.8599 8.1667 1.2622 2.3202 2.2312 2.0874 1.1106 1.1452 1.1060 1.1307 1.0803 2.3319 1.3520 1.7458 8.4217 6.4417 6.3085 6.0967 6.0532 1.0698 1.0723 1.0397 1.0670 1.0663 1.0929 1.0905 1.0994 1.0910 1.0947 1.0953 1.0869 1.0850 1.0877 1.0880 1.0929 1.0930 1.0961 1.1006 1.1010
irintensity: 0.1446 0.6542 1.5246 0.2496 3.1105 0.1160 2.2756 1.1095 0.4939 1.3344 4.6857 2.7330 3.9355 1.7018 2.2239 6.7982 1.6813 13.9819 0.7233 4.2586 6.8565 0.6248 2.4298 9.4247 2.0127 2.8549 0.9779 7.3948 4.8731 2.4320 16.1839 1.2429 4.2570 87.9089 17.8445 66.3001 34.4638 0.9999 1.1401 1.9132 2.0266 5.0776 24.7429 2.1342 8.6346 2.1822 0.5498 7.3923 1.2794 0.2604 0.6656 131.9217 5.3160 2.9389 8.3264 3.7677 10.4620 5.6222 5.0618 24.9831 39.7156 25.0168 0.2446 0.1121 7.2988 7.7946 10.1601 19.1238 124.0063 121.2934 67.9241 19.9870 0.9901 50.4478 15.8658 7.1551 10.8870 9.3940 0.7531 0.4322 15.6137 195.6832 10.4061 18.5998 26.7246 12.9633 15.9770 3.7046 21.5439 8.3761 8.4809 96.0074 239.0754 8.9346 15.5228 41.5917 0.9005 63.4812 56.2968 36.2904 23.7231 64.5421 22.1835 26.9277 24.6867 10.9236 9.3675 11.4724 12.7293 2.1095 9.3473 3.0455 34.8471 24.2892 22.2843 26.1491 19.4520
temp: 298.150 k
press: 1.00000 atm
elementType: 8 7 7 6 6 6 6 6 6 6 6 6 6 6 6 6 6 6 6 6 6 1 1 1 1 1 1 1 1 1 1 1 1 1 1 1 1 1 1 1 1
symmnumber: 1
zpe: 892296.9 jmol-1
zpe.correction: 0.339858 hartree
zpe.thermalcorrener: 0.358192 hartree
zpe.thermalcorrenthalpy: 0.359136 hartree
zpe.thermalcorrgfe: 0.292249 hartree
zpe.sumelectzpe: -881.125304 hartree
zpe.sumelectthermal: -881.106970 hartree
zpe.sumelectthermalent: -881.106026 hartree
zpe.sumelectthermalfe: -881.172913 hartree
dipole: -0.5669 -2.2766 2.2340
dipole: 3.2396
quadrupole: -118.9810 -123.9593 -124.0411
quadrupole: -15.6152 6.1785 6.8946
quadrupole: 3.3461 -1.6322 -1.7139 -15.6152 6.1785 6.8946
hfenergy: -881.4651616 hartree
pointgroup: C01 [X(C18H20N2O1)]
dipole: -0.2111999 -0.7853124 0.9814204 debye
polarizability: 294.540322|-21.5009348|184.5508188|-7.1128588|5.7343774|157.9007678 unknown
InChI: InChI=1S/C18H20N2O/c1-15-7-5-6-10-17(15)19-11-13-20(14-12-19)18(21)16-8-3-2-4-9-16/h2-10H,11-14H2,1H3
charge 0 multiplicity 1
41 atoms
O  2.385133 1.692284 -1.726364
N  -1.690883 0.199266 0.260402
N  1.088489 0.934449 0.056879
C  -0.636026 -0.81027 0.480713
C  -1.253785 1.217613 -0.732578
C  0.65666 -0.128055 0.98947
C  0.028473 1.920986 -0.250314
C  -3.053004 -0.250523 0.188799
C  2.255997 0.933555 -0.709401
C  -4.120682 0.656377 0.497788
C  -3.361463 -1.60078 -0.139412
C  3.396172 0.039121 -0.284712
C  -5.451973 0.179332 0.42591
C  -3.855449 2.078768 0.958966
C  -4.69647 -2.053797 -0.188746
C  -5.753429 -1.157913 0.082457
C  4.13286 -0.626983 -1.296929
C  3.829761 -0.054812 1.063696
C  5.25989 -1.407712 -0.963236
C  4.969664 -0.820134 1.39482
C  5.680444 -1.50851 0.384307
H  -0.392497 -1.376313 -0.451971
H  -0.980375 -1.532593 1.24181
H  -2.050366 1.96351 -0.876054
H  -1.059187 0.739231 -1.721003
H  0.456371 0.315214 1.985483
H  1.450051 -0.883884 1.089926
H  0.41694 2.596109 -1.029797
H  -0.194023 2.498665 0.668612
H  -2.552092 -2.298815 -0.377433
H  -6.268143 0.870286 0.672222
H  -2.894703 2.137276 1.501705
H  -3.805164 2.796763 0.116147
H  -4.662135 2.425967 1.627894
H  -4.907474 -3.097312 -0.449057
H  -6.794519 -1.496146 0.043458
H  3.820278 -0.507071 -2.339428
H  3.297471 0.496121 1.847779
H  5.816167 -1.926945 -1.751401
H  5.305671 -0.873761 2.436277
H  6.561251 -2.107058 0.642411
