program: Gaussian 09
title: 000259527
version: EM64L-G09RevD.01
frameworkgroup: C1[X(C20H19NS2)]
method: RPBEPBE
basis: SDD
operation: Freq
keyword: #p
keyword: freq=noraman
keyword: PBEPBE/SDD
title: #p freq=noraman PBEPBE/SDD
converged: YES YES NO NO
title: Mulliken charges:
elementType: S S N C C C C C C C C C C C C C C C C C C C C H H H H H H H H H H H H H H H H H H H
charge: 0.167722 0.168736 -0.360022 0.564059 0.510174 -0.878771 -0.369061 -0.370564 -0.430961 -0.399772 -0.698205 -0.210752 -0.157499 -0.242303 -0.208797 -0.250170 -0.163632 -0.215429 -0.214908 -0.238900 -0.211349 -0.237845 -0.252504 0.272962 0.267640 0.233493 0.242013 0.219562 0.228384 0.301309 0.281263 0.272218 0.254782 0.253495 0.242634 0.257032 0.229129 0.231824 0.230511 0.228757 0.222049 0.231696
chargesum: 0.00000
title: Mulliken charges with hydrogens summed into heavy atoms:
elementType: S S N C C C C C C C C C C C C C C C C C C C C
charge: 0.167722 0.168736 -0.058713 0.564059 0.510174 -0.338169 -0.135568 -0.128550 -0.211399 -0.171388 -0.144725 -0.210752 -0.157499 0.012479 0.044698 -0.007537 0.093400 0.013701 0.016917 -0.008389 0.017408 -0.015796 -0.020808
polarizability: 3.35897961e+02 1.92504932e-01 2.63148320e+02 -3.52227208e+00 8.37443023e+00 1.83792322e+02
1716.lowfreq: -12.9616 -6.1053 -5.8818 0.0011 0.0016 0.0017 2.1483 16.1873 19.0698
frequency: -9.2288 16.0743 19.0462 25.4707 36.2432 46.0837 70.5189 72.6301 87.4482 117.1906 151.1321 175.1483 201.3200 224.4786 236.1817 276.3160 324.4684 346.1815 358.0965 390.9422 391.1416 400.9192 405.9561 408.5464 441.2949 470.4071 473.8773 488.7138 531.7034 550.9210 594.4402 610.4399 611.0884 625.5655 636.1366 671.2402 678.7040 692.7716 697.7429 726.0973 742.6450 750.4807 755.4562 813.3050 817.5536 833.1650 839.9323 852.7811 885.0584 904.8074 923.4466 928.1258 944.8155 958.0779 966.8723 978.9496 983.5018 985.6424 987.2051 996.7415 1000.4398 1016.1559 1018.9713 1067.9047 1070.6954 1074.6939 1082.9372 1098.9456 1117.9862 1150.6582 1171.0199 1171.7942 1180.5632 1191.7970 1193.0966 1211.2233 1216.5437 1235.0802 1264.3121 1298.1569 1300.2698 1315.0146 1330.8826 1370.5743 1374.1406 1377.9725 1423.6765 1424.2946 1427.0593 1441.0444 1446.4732 1457.8215 1464.5963 1489.7214 1521.7024 1583.5204 1584.1724 1584.8001 1586.0226 1592.1950 1628.0114 3022.3624 3031.0187 3106.0630 3112.9364 3122.6955 3124.3801 3125.9055 3127.3360 3133.0009 3134.0825 3137.9822 3146.3703 3147.2411 3152.4126 3154.8253 3160.0611 3166.1426 3169.8679 3542.9895
redmass: 5.2809 5.2116 4.5960 5.5978 4.7290 4.8232 4.1721 6.7668 4.9405 4.5595 5.7674 4.4673 3.6888 3.4024 5.0440 5.8488 2.9173 3.0464 6.5864 9.5850 8.4983 2.8501 2.8496 2.9274 3.3185 3.1943 3.1616 3.2538 3.9249 1.5948 3.7276 6.4550 6.2883 5.0526 6.5657 6.6437 6.7262 2.2410 2.1762 3.6882 1.5236 2.5479 1.8239 2.3384 1.5250 1.8520 1.3285 1.2432 1.6701 1.3734 1.7961 1.3951 1.3730 1.3639 1.3934 1.3993 4.3300 3.3138 1.7641 1.3166 2.8729 3.3608 3.4089 1.6646 2.4639 2.2597 1.6472 2.4359 1.7455 1.0835 1.0532 1.0543 1.1114 1.1133 1.1272 1.2472 1.1442 2.3286 1.5445 1.3260 1.3738 1.3239 1.4679 9.4579 7.2309 3.8075 2.0666 3.6090 2.0934 1.1301 1.1363 2.0470 2.0082 1.6673 2.8898 6.0644 5.6889 5.0843 5.9175 5.8718 6.4215 1.0641 1.0584 1.1072 1.0873 1.0984 1.0847 1.0848 1.0903 1.0883 1.0877 1.0964 1.0936 1.0929 1.0957 1.0963 1.0956 1.1014 1.0999 1.0758
irintensity: 0.4698 0.7876 0.1648 0.3129 0.2686 0.1371 2.1161 0.3945 0.1188 2.3411 1.9693 2.9263 16.2825 8.5061 8.9716 1.5678 1.0229 5.2608 4.5224 0.1524 1.2625 0.1569 0.2829 0.9489 17.3022 9.2704 61.9278 11.9015 10.0586 84.4938 42.4683 0.3130 9.1086 116.9444 2.4375 13.6490 6.1885 26.1252 39.3877 9.2860 63.0160 18.2896 44.7796 10.6077 6.2203 54.8643 6.3188 0.1016 3.9206 0.9581 7.2717 3.4219 0.1703 0.3950 0.2360 0.2343 1.3257 1.3467 1.8822 0.1748 0.4118 14.0692 19.8329 5.6327 27.6466 5.9463 10.1942 40.0609 39.3660 3.8471 0.4757 0.0389 1.1527 21.9286 11.8532 96.4662 7.4459 1.9900 153.1512 1.3951 5.4377 1.2033 17.0504 0.3940 0.7764 38.8010 14.0366 0.7430 6.2487 13.6397 6.1292 24.4332 36.9846 17.6136 242.6262 0.6406 0.5505 9.8069 4.1156 36.2643 174.9362 36.1849 29.1137 4.8242 13.1017 11.7859 0.2824 1.5844 10.0343 7.7033 6.8867 24.0756 29.9764 13.4212 11.0093 35.7436 11.7232 16.0670 14.7084 28.2751
temp: 298.150 k
press: 1.00000 atm
elementType: 16 16 7 6 6 6 6 6 6 6 6 6 6 6 6 6 6 6 6 6 6 6 6 1 1 1 1 1 1 1 1 1 1 1 1 1 1 1 1 1 1 1
symmnumber: 1
zpe: 870318.3 jmol-1
zpe.correction: 0.331487 hartree
zpe.thermalcorrener: 0.352168 hartree
zpe.thermalcorrenthalpy: 0.353112 hartree
zpe.thermalcorrgfe: 0.278267 hartree
zpe.sumelectzpe: -1622.771166 hartree
zpe.sumelectthermal: -1622.750485 hartree
zpe.sumelectthermalent: -1622.749541 hartree
zpe.sumelectthermalfe: -1622.824386 hartree
dipole: -0.6041 -0.7176 1.8984
dipole: 2.1175
quadrupole: -150.5646 -137.9185 -149.0989
quadrupole: 1.3005 9.2074 3.7761
quadrupole: -4.7039 7.9422 -3.2382 1.3005 9.2074 3.7761
hfenergy: -1623.102653 hartree
pointgroup: C01 [X(C20H19N1S2)]
dipole: 0.0606269 0.1118005 0.8233111 debye
polarizability: 327.8666267|0.6252509|262.741918|33.844713|11.074712|192.2300588 unknown
InChI: InChI=1S/C20H19NS2/c1-3-7-19(8-4-1)22-15-17-11-13-18(14-12-17)21-16-23-20-9-5-2-6-10-20/h1-14,21H,15-16H2
charge 0 multiplicity 1
42 atoms
S  -3.457196 0.747794 -2.185044
S  4.323962 0.876187 1.623718
N  1.995899 2.532335 1.467114
C  -1.954135 2.15765 -0.142817
C  0.694224 2.375288 0.953713
C  -3.331973 2.025844 -0.723496
C  -0.993448 3.038366 -0.71048
C  -1.560618 1.398141 0.988579
C  0.302765 3.147876 -0.18038
C  -0.266426 1.501892 1.538307
C  2.689806 1.620137 2.337706
C  -3.259529 -0.822331 -1.238362
C  3.794783 -0.454905 0.466468
C  -4.395626 -1.462364 -0.685599
C  -1.976091 -1.399052 -1.083799
C  4.824271 -1.323177 0.019011
C  2.469104 -0.639036 0.007863
C  -4.245412 -2.676125 0.024822
C  -1.829768 -2.613793 -0.373079
C  -2.96261 -3.252626 0.182714
C  4.52519 -2.368888 -0.880725
C  2.180558 -1.695023 -0.888411
C  3.200434 -2.562173 -1.338859
H  -4.075678 1.695387 0.018879
H  -3.684608 2.955402 -1.201272
H  -1.263818 3.635131 -1.590128
H  -2.282135 0.71714 1.455235
H  1.028012 3.827467 -0.645666
H  -0.027015 0.92634 2.438363
H  2.567085 3.263523 1.039718
H  3.087325 2.117065 3.240069
H  2.043077 0.784341 2.638748
H  -5.385954 -1.015249 -0.823439
H  -1.108048 -0.89345 -1.519387
H  5.850991 -1.186024 0.376868
H  1.660486 0.027963 0.319039
H  -5.126951 -3.171424 0.447218
H  -0.834772 -3.056844 -0.250391
H  -2.847834 -4.194199 0.731465
H  5.328457 -3.033227 -1.218485
H  1.153138 -1.824128 -1.247151
H  2.969477 -3.373032 -2.037945
