program: Gaussian 09
title: 000259483
version: EM64L-G09RevD.01
frameworkgroup: C1[X(C17H17ClN2O)]
method: RPBEPBE
basis: SDD
operation: Freq
keyword: #p
keyword: freq=noraman
keyword: PBEPBE/SDD
title: #p freq=noraman PBEPBE/SDD
converged: NO YES NO NO
title: Mulliken charges:
elementType: Cl O N N C C C C C C C C C C C C C C C C C H H H H H H H H H H H H H H H H H
charge: -0.078421 -0.280411 -0.175389 -0.145771 -0.400683 -0.418202 -0.394889 -0.369837 0.449249 0.152853 -0.352125 -0.352317 0.242637 -0.219981 -0.219358 -0.309220 -0.366561 -0.117926 -0.250917 -0.223585 -0.226505 0.230891 0.222455 0.235219 0.218781 0.259149 0.215826 0.257580 0.238761 0.237990 0.238963 0.248784 0.248981 0.239070 0.267747 0.231250 0.232649 0.233262
chargesum: 0.00000
title: Mulliken charges with hydrogens summed into heavy atoms:
elementType: Cl O N N C C C C C C C C C C C C C C C C C
charge: -0.078421 -0.280411 -0.175389 -0.145771 0.052664 0.035798 0.080085 0.126505 0.449249 0.152853 -0.114135 -0.113354 0.242637 0.028803 0.029623 -0.070150 -0.098814 -0.117926 -0.019667 0.009063 0.006757
polarizability: 3.31755596e+02 1.00067098e+01 1.69797526e+02 1.44418566e+01 2.39498026e+00 1.43522497e+02
1716.lowfreq: -14.0153 -4.7700 -0.0021 -0.0018 -0.0009 1.8571 13.2770 31.8629 45.4208
frequency: 12.8508 31.7752 45.3384 64.2485 77.5989 99.4447 106.9296 126.0847 169.8157 182.3764 211.6571 234.8461 269.0806 278.1966 301.6691 327.2301 339.0868 370.7201 403.7825 416.3032 422.9192 445.5065 488.9370 492.2862 503.3028 561.4292 613.9611 620.5355 625.2830 632.0780 684.6660 691.7941 705.5446 706.9056 729.1586 788.5282 791.7924 802.2420 857.5681 860.3528 868.2855 921.9581 929.9715 936.3682 938.2563 971.3141 981.5364 981.8980 990.0871 1001.6073 1003.7231 1028.9009 1052.7537 1075.1507 1078.7459 1081.8381 1084.5403 1118.8384 1149.0143 1173.9203 1178.1148 1189.3658 1194.4250 1196.3095 1216.5442 1247.0185 1261.0067 1278.1585 1303.2999 1316.7176 1339.9007 1352.7258 1358.2416 1361.6601 1379.5925 1380.6564 1381.8819 1385.3538 1416.8324 1432.4170 1471.0274 1474.1548 1481.9572 1486.5269 1487.6305 1498.4494 1543.4218 1569.5087 1590.3524 1610.1198 1615.1740 2927.4323 2934.5678 2970.7432 2984.8967 3021.7269 3029.7449 3066.1899 3078.0332 3127.1548 3135.6134 3147.1656 3149.4485 3149.6212 3157.9444 3168.8403 3169.2750 3172.9018
redmass: 6.0120 5.7180 3.7972 6.0954 5.2911 3.3371 5.2721 6.0714 3.6817 6.5855 5.1316 3.7969 4.6354 2.2890 4.2009 5.8935 2.9091 7.3104 2.8429 3.0316 4.4728 3.9425 3.5068 3.8552 2.7431 4.0684 6.4238 5.6733 6.7273 2.5217 4.8697 3.1400 2.3632 2.3895 5.0278 2.2889 1.2695 1.7751 1.3683 1.7904 2.6114 1.3333 2.7025 1.5833 1.3935 2.0733 1.3885 4.1495 5.8942 1.3438 2.5516 2.1405 1.9607 2.0584 2.5407 2.0391 1.7283 1.3983 2.4132 1.0565 2.9302 1.1161 1.2032 1.6181 1.2232 1.7989 1.5147 1.4949 1.3484 1.3289 1.4255 1.6074 1.6731 1.4156 2.5559 6.5137 2.4177 3.6651 3.7013 2.2417 1.1217 1.1249 2.1999 1.2598 1.0884 2.0159 9.5152 7.5149 6.2983 6.0266 6.2622 1.0686 1.0690 1.0672 1.0667 1.0949 1.0926 1.0964 1.0952 1.0849 1.0881 1.0928 1.0875 1.0872 1.0962 1.0962 1.1011 1.0970
irintensity: 1.6716 0.2653 0.1831 3.4751 0.6098 0.5228 2.2082 2.0738 4.7341 1.7226 4.2347 4.6600 0.6813 3.9708 1.1602 3.9268 3.0677 14.2865 0.3203 0.5041 5.5241 4.0864 1.5334 1.4453 21.8523 2.8306 0.9899 35.5102 2.0379 0.8280 10.3281 1.2493 26.7086 60.2530 23.4095 28.6913 1.1158 84.2480 3.5212 1.1814 8.0744 1.0763 6.6469 8.0201 3.1620 0.3083 1.6901 27.4114 0.3179 0.9885 76.6974 2.3338 6.2554 0.9477 19.9108 9.5135 8.3478 5.5871 15.4303 0.7093 27.1132 10.3824 8.8254 10.7601 158.0495 12.5278 19.6947 41.1489 0.7617 0.6232 1.2633 0.1767 54.7105 22.6364 221.3592 1.2960 82.1859 172.1950 1.7701 10.1456 73.1841 77.2567 5.4302 125.7441 4.4839 178.8544 227.5778 2.1566 14.8814 4.6203 136.3777 84.0829 31.8149 40.9033 20.0403 29.0455 29.5141 14.6921 13.7461 1.7239 3.6844 25.9299 2.2316 21.0231 20.7639 14.8791 19.4051 1.7048
temp: 298.150 k
press: 1.00000 atm
elementType: 17 8 7 7 6 6 6 6 6 6 6 6 6 6 6 6 6 6 6 6 6 1 1 1 1 1 1 1 1 1 1 1 1 1 1 1 1 1
symmnumber: 1
zpe: 794633.7 jmol-1
zpe.correction: 0.302660 hartree
zpe.thermalcorrener: 0.321058 hartree
zpe.thermalcorrenthalpy: 0.322002 hartree
zpe.thermalcorrgfe: 0.253681 hartree
zpe.sumelectzpe: -1301.288377 hartree
zpe.sumelectthermal: -1301.269980 hartree
zpe.sumelectthermalent: -1301.269035 hartree
zpe.sumelectthermalfe: -1301.337357 hartree
dipole: -2.7374 -2.6374 1.0782
dipole: 3.9512
quadrupole: -156.4882 -131.1467 -125.5474
quadrupole: 21.3351 0.1348 5.3512
quadrupole: -18.7608 6.5808 12.1800 21.3351 0.1348 5.3512
hfenergy: -1301.5910372 hartree
pointgroup: C01 [X(C17H17Cl1N2O1)]
dipole: 1.093281 0.9573669 0.5520032 debye
polarizability: 330.8821451|12.1945662|169.8858119|-18.0259144|1.4817072|144.307662 unknown
InChI: InChI=1S/C17H17ClN2O/c18-15-6-8-16(9-7-15)19-10-12-20(13-11-19)17(21)14-4-2-1-3-5-14/h1-9H,10-13H2
charge 0 multiplicity 1
38 atoms
Cl -7.548939 0.746848 0.224279
O  2.908961 -2.13327 -1.134815
N  -1.572571 -0.310051 -0.01543
N  1.306423 -0.803105 -0.12341
C  -0.621979 0.740383 -0.423167
C  -0.999446 -1.617745 0.360758
C  0.74752 0.517105 0.250388
C  0.317934 -1.879713 -0.387002
C  -2.952057 -0.067916 0.038533
C  2.619393 -1.051999 -0.522173
C  -3.52429 1.089563 -0.578171
C  -3.836799 -0.968384 0.712002
C  3.691735 -0.043226 -0.198568
C  -4.910328 1.337748 -0.518104
C  -5.223989 -0.724727 0.763433
C  3.764162 0.639724 1.04367
C  4.733907 0.131817 -1.145909
C  -5.749771 0.427773 0.150764
C  4.850531 1.497847 1.324446
C  5.808536 1.003313 -0.872796
C  5.869257 1.690722 0.363152
H  -1.001471 1.726327 -0.093854
H  -0.494759 0.782498 -1.527155
H  -1.705412 -2.420036 0.07712
H  -0.835965 -1.694897 1.4584
H  1.442345 1.312439 -0.064821
H  0.618005 0.595706 1.348863
H  0.754234 -2.842366 -0.069935
H  0.129136 -1.961706 -1.476029
H  -2.896481 1.789658 -1.136988
H  -3.447158 -1.851377 1.226497
H  -5.329631 2.225307 -1.001457
H  -5.883482 -1.422062 1.288692
H  2.996078 0.474944 1.807568
H  4.692278 -0.437692 -2.080088
H  4.905513 2.007281 2.292777
H  6.602769 1.139016 -1.614986
H  6.709413 2.359953 0.579417
