program: Gaussian 09
title: 000259465
version: EM64L-G09RevD.01
frameworkgroup: C1[X(C13H18ClNO2)]
method: RPBEPBE
basis: SDD
operation: Freq
keyword: #p
keyword: freq=noraman
keyword: PBEPBE/SDD
title: #p freq=noraman PBEPBE/SDD
converged: YES YES NO NO
title: Mulliken charges:
elementType: Cl O O N C C C C C C C C C C C C C H H H H H H H H H H H H H H H H H H
charge: -0.046636 -0.471173 -0.267820 -0.166100 -0.402301 -0.423672 -0.438678 -0.442396 -0.381644 -0.070563 -0.346656 0.504433 -0.315255 -0.326621 -0.211185 -0.234905 -0.242717 0.235336 0.225214 0.236209 0.218759 0.222951 0.233136 0.232601 0.220153 0.235506 0.213763 0.204107 0.239482 0.221294 0.368540 0.260274 0.253765 0.229393 0.233406
chargesum: 0.00000
title: Mulliken charges with hydrogens summed into heavy atoms:
elementType: Cl O O N C C C C C C C C C C C C C
charge: -0.046636 -0.102633 -0.267820 -0.166100 0.058249 0.031296 0.017409 0.010358 0.067624 0.133545 0.114120 0.504433 -0.315255 -0.066347 0.042580 -0.005512 -0.009311
polarizability: 2.07386695e+02 -9.75146518e+00 1.66570248e+02 1.10353601e+01 -6.48142682e+00 1.05586251e+02
1716.lowfreq: -26.1155 -2.3311 -0.0018 0.0006 0.0011 5.2544 10.2983 24.1601 29.1073
frequency: -24.6049 23.9806 28.8588 47.0747 75.2983 85.4876 98.6598 137.0234 151.4134 191.3447 194.3710 213.7375 261.3549 334.9693 362.4719 385.2320 389.5224 440.0384 457.2019 505.6034 521.5424 540.7570 590.0822 627.0558 661.1879 672.4765 709.0851 725.8085 750.9497 768.7204 800.2049 822.8140 837.7867 841.7032 866.1730 881.8733 916.2176 924.4717 936.6302 940.8087 969.2162 974.9252 1018.0556 1020.9360 1038.6490 1041.9034 1055.0781 1062.4174 1072.7118 1099.9792 1128.5285 1130.7654 1171.4614 1176.0306 1180.6281 1213.9373 1219.9696 1236.6943 1243.8302 1258.3263 1266.6687 1286.2098 1290.7349 1298.3633 1302.2788 1314.3245 1317.0060 1338.4944 1355.1657 1380.9156 1428.4355 1431.0591 1453.6474 1465.6072 1466.2476 1473.3168 1477.3448 1482.0369 1488.5947 1574.9368 1605.0778 2941.1709 2971.9172 2975.0618 2994.5739 3004.0031 3009.2416 3023.8967 3045.2041 3051.6430 3060.0889 3075.7915 3082.2651 3095.1713 3139.0725 3154.3524 3166.4687 3177.5309 3182.6597
redmass: 2.0796 6.3353 4.9981 2.7560 4.7754 3.5854 3.9923 3.0914 5.5758 4.0715 6.1736 3.5712 5.5328 3.9940 3.8777 2.6114 3.7406 3.2253 2.4397 3.8571 4.3159 3.8406 6.6766 2.3310 2.7946 5.0586 3.4960 1.0975 1.2825 1.8524 5.8420 2.2600 1.5692 1.6374 2.6365 3.2673 2.3681 1.4052 1.6643 1.5986 1.3117 8.2956 2.7403 7.3409 2.4579 2.0945 2.9868 2.0880 1.8523 2.3778 1.7371 1.6142 1.0665 1.3012 1.2542 1.3659 1.1874 2.6080 1.3361 1.3629 1.5788 1.2936 1.1154 1.1689 1.3084 1.4999 1.2043 1.2884 1.4408 5.3427 2.1755 1.8033 1.0906 1.9333 1.0834 1.0832 1.0908 1.2724 1.0949 6.3559 7.2124 1.0833 1.0598 1.0561 1.0647 1.0627 1.0600 1.0644 1.1065 1.1040 1.1021 1.1011 1.1030 1.1059 1.0856 1.0899 1.0941 1.1004 1.0632
irintensity: 0.0905 1.7124 0.9611 0.5047 0.3073 0.7606 2.3407 3.6506 1.9348 5.3297 2.8379 2.4087 0.1583 5.2283 4.5519 0.8556 0.6691 5.6169 5.0425 14.5157 8.0236 0.3246 2.4616 1.6480 2.1844 31.7816 0.9544 78.0533 110.5190 17.5806 7.9290 19.6256 0.0098 3.8751 5.4388 9.3799 1.7384 1.9610 9.9792 13.2120 0.1817 85.7710 18.0363 62.1837 8.1546 27.6061 50.1272 44.1476 14.3922 22.1861 3.7939 6.7704 4.5556 1.7132 6.6566 8.6270 3.6146 183.6829 19.7952 5.9644 58.6473 3.0239 32.9873 13.9032 3.4884 9.1130 8.5748 18.2320 25.1299 9.7542 13.7169 78.6063 21.9559 160.6405 0.6753 15.8480 3.7632 9.5845 7.6230 12.5657 49.0768 37.0288 24.3533 38.1836 45.4415 27.8613 46.5479 45.5873 18.3038 37.0628 19.2768 3.0065 19.9832 93.8682 2.9386 12.1032 13.5382 12.4990 252.6395
temp: 298.150 k
press: 1.00000 atm
elementType: 17 8 8 7 6 6 6 6 6 6 6 6 6 6 6 6 6 1 1 1 1 1 1 1 1 1 1 1 1 1 1 1 1 1 1
symmnumber: 1
zpe: 757718.3 jmol-1
zpe.correction: 0.288600 hartree
zpe.thermalcorrener: 0.304531 hartree
zpe.thermalcorrenthalpy: 0.305475 hartree
zpe.thermalcorrgfe: 0.242765 hartree
zpe.sumelectzpe: -1170.101382 hartree
zpe.sumelectthermal: -1170.085451 hartree
zpe.sumelectthermalent: -1170.084507 hartree
zpe.sumelectthermalfe: -1170.147217 hartree
dipole: -1.0343 0.6858 1.4438
dipole: 1.9039
quadrupole: -86.9625 -115.5005 -109.7675
quadrupole: -10.2875 0.8697 -2.8996
quadrupole: 17.1143 -11.4236 -5.6907 -10.2875 0.8697 -2.8996
hfenergy: -1170.3899816 hartree
pointgroup: C01 [X(C13H18Cl1N1O2)]
dipole: 0.5206903 0.077632 -0.5328429 debye
polarizability: 203.1543792|10.354574|163.9169503|25.1636238|-8.6563391|112.4718648 unknown
InChI: InChI=1S/C13H18ClNO2/c14-12-5-1-2-6-13(12)17-10-11(16)9-15-7-3-4-8-15/h1-2,5-6,11,16H,3-4,7-10H2
charge 0 multiplicity 1
35 atoms
Cl -1.758045 2.926506 -0.377613
O  1.376912 -2.233544 1.69744
O  -1.085401 0.140887 0.355558
N  3.20783 -0.527035 0.777808
C  3.666513 0.519344 1.751039
C  4.260826 -0.493891 -0.282153
C  4.320074 1.665506 0.901486
C  4.612484 1.012831 -0.490613
C  1.815915 -0.294564 0.277289
C  0.844628 -0.930523 1.307311
C  -0.554843 -1.180598 0.743467
C  -2.375369 0.203211 -0.165846
C  -2.849435 1.48227 -0.561801
C  -3.235569 -0.913789 -0.324278
C  -4.137481 1.655786 -1.093346
C  -4.532179 -0.743832 -0.85885
C  -4.989221 0.534932 -1.243715
H  4.41614 0.064637 2.424251
H  2.821625 0.864775 2.369983
H  3.910351 -1.000949 -1.196386
H  5.146715 -1.039763 0.095041
H  5.243197 2.032166 1.383294
H  3.637789 2.526868 0.798694
H  3.966645 1.453725 -1.270748
H  5.660754 1.150352 -0.807955
H  1.564929 0.773102 0.11501
H  1.71266 -0.828824 -0.685595
H  0.757366 -0.263745 2.19326
H  -1.196707 -1.643827 1.517558
H  -0.501387 -1.850177 -0.138228
H  2.374633 -2.097553 1.580117
H  -2.896326 -1.911291 -0.031107
H  -4.468836 2.656635 -1.386093
H  -5.183017 -1.617313 -0.972272
H  -5.993571 0.668482 -1.657206
