program: Gaussian 09
title: 000259461
version: EM64L-G09RevD.01
frameworkgroup: C1[X(C12H16ClN3O)]
method: RPBEPBE
basis: SDD
operation: Freq
keyword: #p
keyword: freq=noraman
keyword: PBEPBE/SDD
title: #p freq=noraman PBEPBE/SDD
converged: YES YES NO NO
title: Mulliken charges:
elementType: Cl O N N N C C C C C C C C C C C C H H H H H H H H H H H H H H H H
charge: -0.056492 -0.324151 -0.073733 -0.140212 -0.657062 -0.326667 -0.347568 -0.388549 -0.377997 -0.499212 0.585644 0.271535 -0.307773 -0.407327 -0.229184 -0.241177 -0.227023 0.228730 0.182331 0.192976 0.215121 0.184564 0.227601 0.218777 0.259429 0.230540 0.198576 0.241213 0.340049 0.304403 0.255065 0.232200 0.235367
chargesum: 0.00000
title: Mulliken charges with hydrogens summed into heavy atoms:
elementType: Cl O N N N C C C C C C C C C C C C
charge: -0.056492 -0.324151 -0.073733 -0.140212 -0.012609 0.084395 0.060530 0.023616 0.100210 -0.070096 0.585644 0.271535 -0.307773 -0.166113 0.025882 -0.008977 0.008344
polarizability: 1.97468646e+02 1.80227390e+01 1.63067762e+02 1.75819707e+01 -2.69930287e+00 1.16384039e+02
1716.lowfreq: -17.8400 -8.9547 -4.4063 -0.0020 -0.0020 -0.0007 15.4865 27.1159 35.3315
frequency: 15.4544 26.4729 35.1242 50.3422 70.7478 129.7417 145.0828 169.4761 229.0878 251.2510 262.4258 273.4105 305.7728 358.4966 364.4695 372.2910 395.1398 426.6959 445.9818 463.2874 488.0027 507.7116 519.1690 558.7533 601.6573 604.2172 663.3417 705.2466 716.5225 721.8928 754.8863 780.8012 824.0313 842.9937 871.7579 925.3833 947.2713 977.5857 984.5760 987.9436 998.4461 1022.4293 1035.0831 1040.7128 1053.1368 1074.6366 1114.2667 1128.7588 1142.9781 1148.1507 1171.8377 1190.9518 1204.6381 1212.9376 1241.9070 1272.7178 1277.5373 1295.0383 1301.1724 1329.9372 1340.7955 1357.3980 1370.6460 1378.4482 1390.2985 1425.2910 1436.3803 1453.3428 1455.6762 1458.6599 1465.2771 1467.8729 1472.8700 1577.3330 1579.4824 1604.3680 1631.4627 2835.1986 2852.7966 2869.8873 2963.4879 2972.6926 3028.6159 3036.8513 3040.3258 3072.0196 3094.0315 3121.9774 3140.3953 3158.2689 3173.5919 3555.3358 3706.2832
redmass: 6.1038 4.5325 6.2017 5.2988 3.1915 4.3542 4.7621 4.0384 3.5470 3.5594 2.5519 3.4546 2.9377 2.8197 1.8030 3.5812 1.7969 4.0742 3.4076 2.6901 3.1445 1.1705 3.3139 4.9871 3.0217 3.1151 6.3422 7.3144 3.8566 3.6640 1.3864 2.6931 3.7604 1.5899 1.4481 1.9972 1.4006 2.7803 1.4532 1.6920 2.7919 6.2687 2.0800 1.9944 1.7547 2.2188 2.0988 1.9281 2.0718 2.5699 1.0732 1.5358 1.2228 2.2812 2.1443 1.4295 1.4926 1.4508 1.4235 1.3115 1.2497 1.4419 1.4273 5.7304 1.5049 2.1109 1.9256 1.2063 1.2332 1.3633 1.3934 1.2976 1.1735 6.1200 2.0353 7.1997 2.0408 1.0713 1.0708 1.0698 1.0670 1.0679 1.0874 1.0877 1.0904 1.0938 1.0944 1.0879 1.0888 1.0946 1.0996 1.0447 1.1038
irintensity: 1.4392 2.3326 0.1847 0.3373 15.7339 1.8406 1.6546 6.6365 1.2569 0.9695 5.2771 0.8388 16.5553 52.9906 67.3432 2.9342 32.3051 4.8704 10.1163 3.3460 8.8978 115.0168 11.1799 7.4332 3.8946 3.6978 16.5407 25.0556 2.8310 6.6128 80.2908 19.9022 2.7447 0.9049 1.8203 5.3288 1.6039 35.2674 3.2075 11.3102 63.3695 55.2496 3.8885 7.6244 1.6867 1.0453 40.8509 17.0907 5.8926 15.7268 0.7764 2.1122 4.8314 7.4868 8.6620 22.0648 74.5408 13.9227 105.8588 26.5247 4.6790 1.7132 8.8986 0.3031 5.3352 21.5408 238.8902 12.0610 45.3662 17.9642 15.1229 44.8545 12.6961 9.6766 353.6609 3.4042 254.9891 56.5864 56.2476 161.8929 41.8993 52.7377 6.6156 39.5503 33.9924 36.1963 5.3627 6.9678 8.5150 16.7112 14.3892 31.2717 37.0356
temp: 298.150 k
press: 1.00000 atm
elementType: 17 8 7 7 7 6 6 6 6 6 6 6 6 6 6 6 6 1 1 1 1 1 1 1 1 1 1 1 1 1 1 1 1
symmnumber: 1
zpe: 702920.5 jmol-1
zpe.correction: 0.267728 hartree
zpe.thermalcorrener: 0.284003 hartree
zpe.thermalcorrenthalpy: 0.284947 hartree
zpe.thermalcorrgfe: 0.221164 hartree
zpe.sumelectzpe: -1165.143058 hartree
zpe.sumelectthermal: -1165.126783 hartree
zpe.sumelectthermalent: -1165.125839 hartree
zpe.sumelectthermalfe: -1165.189621 hartree
dipole: -3.3887 -4.5254 -0.8431
dipole: 5.7161
quadrupole: -121.7380 -100.1401 -104.1589
quadrupole: -8.0351 -5.4264 3.3951
quadrupole: -13.0590 8.5389 4.5201 -8.0351 -5.4264 3.3951
hfenergy: -1165.4107858 hartree
pointgroup: C01 [X(C12H16Cl1N3O1)]
dipole: 1.3726111 1.7813485 0.01274 debye
polarizability: 198.3305472|20.236757|159.4419478|-13.6863309|11.5327515|119.1479515 unknown
InChI: InChI=1S/C12H16ClN3O/c13-11-4-2-1-3-10(11)9-15-5-7-16(8-6-15)12(14)17/h1-4H,5-9,14H2
charge 0 multiplicity 1
33 atoms
Cl 2.282879 -2.274971 -1.09664
O  -5.151147 -0.641249 0.032973
N  -0.235903 -0.513952 0.430252
N  -2.939302 0.006356 -0.380088
N  -4.743587 1.550864 -0.608556
C  -0.735016 0.874674 0.355141
C  -1.320474 -1.458216 0.795554
C  -1.880273 0.984842 -0.677052
C  -2.457061 -1.382176 -0.238094
C  0.969496 -0.658941 1.282622
C  2.208406 -0.057235 0.637231
C  -4.312602 0.255869 -0.304418
C  2.876368 -0.671041 -0.449989
C  2.750859 1.164172 1.114458
C  4.016458 -0.109749 -1.056784
C  3.893545 1.751418 0.5269
C  4.525407 1.114111 -0.564258
H  0.0930 1.537798 0.045063
H  -1.110999 1.22996 1.35067
H  -1.735822 -1.241807 1.812383
H  -0.906498 -2.48321 0.80173
H  -2.274016 2.014372 -0.640053
H  -1.464256 0.801861 -1.689844
H  -2.07583 -1.741363 -1.215983
H  -3.315106 -2.002241 0.066582
H  1.127562 -1.742131 1.439562
H  0.826449 -0.194919 2.291434
H  2.261624 1.652094 1.966503
H  -5.744594 1.707154 -0.525449
H  -4.165756 2.270236 -1.033043
H  4.500908 -0.62306 -1.892638
H  4.288278 2.694958 0.918132
H  5.412405 1.556223 -1.0303
