program: Gaussian 09
title: 000259452
version: EM64L-G09RevD.01
frameworkgroup: C1[X(C10H13N5O4)]
method: RPBEPBE
basis: SDD
operation: Freq
keyword: #p
keyword: freq=noraman
keyword: PBEPBE/SDD
title: #p freq=noraman PBEPBE/SDD
converged: YES YES NO NO
title: Mulliken charges:
elementType: O O O O N N N N N C C C C C C C C C C H H H H H H H H H H H H H
charge: -0.249455 -0.442124 -0.448611 -0.436457 -0.131790 -0.062447 -0.042469 -0.080297 -0.614345 -0.197096 -0.174556 -0.116664 -0.101099 -0.378116 0.189792 0.016529 -0.379480 0.192558 -0.343616 0.267735 0.272026 0.297942 0.255887 0.215092 0.254683 0.351688 0.352171 0.271217 0.339494 0.250839 0.327935 0.343032
chargesum: 0.00000
title: Mulliken charges with hydrogens summed into heavy atoms:
elementType: O O O O N N N N N C C C C C C C C C C
charge: -0.249455 -0.090435 -0.096440 -0.096963 -0.131790 -0.062447 -0.042469 -0.080297 0.056623 0.070639 0.097470 0.181277 0.154789 0.091659 0.189792 0.016529 -0.108263 0.192558 -0.092776
polarizability: 2.26144598e+02 2.00095077e-01 1.54529283e+02 6.73841352e+00 -1.50498262e+00 9.28414028e+01
1716.lowfreq: -16.2567 -0.0008 -0.0008 0.0003 4.4258 7.8075 31.8331 37.9737 63.4537
frequency: 31.0224 37.8271 63.4484 87.6453 125.1163 138.0015 150.2633 186.5567 200.4986 213.5254 234.5342 273.7822 274.7472 301.0245 315.5221 319.7450 355.7038 373.3397 420.6090 443.4195 463.1973 507.5951 528.4040 540.5991 553.9008 559.1898 624.3228 643.8339 678.2104 690.6051 705.3142 754.9550 769.5535 793.6761 796.5910 831.0625 843.4782 866.6148 874.8915 922.4707 940.2251 952.0084 957.4771 972.4304 988.2438 998.7066 1028.4673 1045.2345 1056.7306 1073.5576 1093.6116 1153.2806 1168.6692 1188.7717 1210.1504 1219.3038 1237.5117 1248.6921 1277.7432 1286.6853 1289.3611 1309.8879 1322.9266 1326.7710 1340.6498 1352.2482 1359.5650 1361.5384 1382.4137 1410.1911 1433.0984 1448.5745 1472.0839 1476.6984 1540.1875 1583.8872 1629.4815 2993.1594 3018.9079 3023.6525 3060.7065 3078.7767 3107.7695 3135.8599 3170.3596 3217.9507 3540.6156 3562.6778 3572.6377 3697.5473
redmass: 6.3447 6.4542 6.0073 4.8147 4.9741 5.0177 4.2710 6.4467 6.5375 4.8740 4.8138 4.7933 4.7227 1.8693 1.1340 3.3878 2.4100 4.4028 4.9727 1.1624 5.4739 7.2972 4.6179 4.3946 4.0173 1.2038 7.9043 4.7384 9.9709 7.6648 6.2076 3.8917 1.1880 4.0344 5.2387 2.6188 1.6721 7.3885 3.9286 3.4018 1.4438 3.3848 2.4305 3.7786 4.4771 3.4750 4.4520 3.0907 2.1146 1.6000 4.6065 1.4103 1.3513 1.7860 1.7070 4.8292 1.4139 2.2095 1.1901 1.4056 1.2022 4.0055 1.5077 2.2932 1.6931 1.4700 2.6495 1.2280 2.0521 2.3357 3.0253 4.0007 1.0872 1.1483 6.4332 3.1034 1.7854 1.0671 1.0854 1.0876 1.0861 1.0873 1.0988 1.0705 1.0926 1.0978 1.0456 1.0663 1.0663 1.1042
irintensity: 1.3822 0.8900 4.5225 4.8951 0.6605 0.4101 10.7597 4.2254 2.9801 5.1568 2.9092 0.9242 7.1573 103.9372 196.9793 16.8663 30.9549 4.9359 12.8187 145.8867 23.1088 1.0973 26.3126 5.0214 2.0523 116.6824 0.2530 17.9201 3.2437 25.4854 18.8458 8.7748 127.2920 22.2673 94.6126 18.6394 11.2545 17.5522 32.2221 92.5914 10.6551 43.7178 4.4090 90.5935 173.7913 72.0484 71.2233 33.5536 12.7361 20.5399 6.2952 3.8923 29.9594 9.7270 32.9489 69.6413 15.0120 23.2230 6.3603 26.2500 10.0211 49.8524 42.2973 36.7756 28.0660 19.7327 25.5226 6.8599 8.2549 47.0043 42.4940 6.9468 9.6258 65.7352 141.6625 155.6336 519.4764 48.0462 41.8138 15.2103 89.3557 6.2138 11.1370 802.1088 14.0098 2.4509 126.3960 8.5377 12.1710 38.3268
temp: 298.150 k
press: 1.00000 atm
elementType: 8 8 8 8 7 7 7 7 7 6 6 6 6 6 6 6 6 6 6 1 1 1 1 1 1 1 1 1 1 1 1 1
symmnumber: 1
zpe: 638880.5 jmol-1
zpe.correction: 0.243337 hartree
zpe.thermalcorrener: 0.260217 hartree
zpe.thermalcorrenthalpy: 0.261161 hartree
zpe.thermalcorrgfe: 0.198459 hartree
zpe.sumelectzpe: -962.064888 hartree
zpe.sumelectthermal: -962.048008 hartree
zpe.sumelectthermalent: -962.047064 hartree
zpe.sumelectthermalfe: -962.109765 hartree
dipole: -4.0586 3.4608 0.0099
dipole: 5.3338
quadrupole: -98.1847 -112.9123 -106.2455
quadrupole: -16.5082 -0.7726 -4.9794
quadrupole: 7.5962 -7.1315 -0.4647 -16.5082 -0.7726 -4.9794
hfenergy: -962.3082247 hartree
pointgroup: C01 [X(C10H13N5O4)]
dipole: -1.4940364 -0.8188406 -1.225135 debye
polarizability: 225.4061729|10.899817|112.9507394|-1.1288931|28.8259298|135.1583713 unknown
InChI: InChI=1S/C10H13N5O4/c11-8-4-1-14-15(9(4)13-3-12-8)10-7(18)6(17)5(2-16)19-10/h1,3,5-7,10,16-18H,2,11H2
charge 0 multiplicity 1
32 atoms
O  1.631151 -0.506562 1.103144
O  2.48298 2.387602 0.360498
O  2.425659 -0.493858 -2.057838
O  5.388079 -0.474783 0.754377
N  -0.323061 0.117047 -0.154291
N  -0.244787 -0.642373 -1.329886
N  -2.07855 0.847194 1.408459
N  -4.316466 0.06987 0.757779
N  -4.751755 -1.23152 -1.135217
C  1.862084 1.332181 -0.450654
C  2.87008 0.218264 -0.86933
C  0.88949 0.613092 0.515111
C  2.938049 -0.68112 0.388945
C  4.063792 -0.314271 1.376506
C  -1.629432 0.191328 0.298307
C  -2.430048 -0.54301 -0.637022
C  -1.509009 -1.03461 -1.619566
C  -3.835767 -0.57802 -0.351551
C  -3.427303 0.734882 1.561589
H  1.348629 1.75014 -1.33759
H  3.865508 0.624406 -1.115208
H  0.544712 1.280268 1.322331
H  3.003872 -1.742568 0.083555
H  3.964398 -0.927388 2.294325
H  3.995496 0.749873 1.648446
H  3.195573 2.824715 -0.170341
H  1.442832 -0.71455 -1.945927
H  -1.683143 -1.637311 -2.509088
H  5.542767 -1.433437 0.558331
H  -3.859775 1.236308 2.432244
H  -4.481955 -1.74261 -1.970981
H  -5.7295 -1.200077 -0.849462
