program: Gaussian 09
title: 000259419
version: EM64L-G09RevD.01
frameworkgroup: C1[X(C14H15NS)]
method: RPBEPBE
basis: SDD
operation: Freq
keyword: #p
keyword: freq=noraman
keyword: PBEPBE/SDD
title: #p freq=noraman PBEPBE/SDD
converged: YES YES NO NO
title: Mulliken charges:
elementType: S N C C C C C C C C C C C C C C H H H H H H H H H H H H H H H
charge: 0.185265 -0.415626 0.495013 -0.846121 0.449302 -0.392270 -0.358342 -0.362985 -0.409924 -0.164828 -0.171214 -0.247122 -0.636732 -0.253150 -0.214615 -0.242731 0.269115 0.266759 0.229594 0.233283 0.234269 0.212637 0.295970 0.245586 0.239863 0.231270 0.220957 0.230264 0.223261 0.225746 0.227505
chargesum: 0.00000
title: Mulliken charges with hydrogens summed into heavy atoms:
elementType: S N C C C C C C C C C C C C C C
charge: 0.185265 -0.119656 0.495013 -0.310246 0.449302 -0.162675 -0.125059 -0.128716 -0.197287 -0.164828 0.074373 -0.007259 0.045759 -0.029889 0.011131 -0.015226
polarizability: 3.24463773e+02 -9.91092873e+00 1.30329685e+02 -1.83897964e+00 -2.16283796e+00 1.18158807e+02
1716.lowfreq: -5.4559 -0.0020 -0.0017 -0.0014 4.5616 8.0793 11.4172 32.1457 39.9996
frequency: 10.7893 31.7057 39.9848 59.4553 93.6153 121.4428 151.7276 178.2867 186.4764 208.0840 276.2089 333.4992 340.6497 359.9767 402.1536 403.3610 412.5468 440.5867 469.7895 515.0132 539.2005 612.0455 635.4450 646.7453 674.4911 692.8646 732.8207 740.9303 756.4287 812.4267 819.3962 831.1021 833.4858 892.3245 901.1403 941.1981 953.9580 965.6184 983.3914 985.3730 997.9528 1019.8192 1071.5456 1073.0087 1081.5039 1096.4906 1124.2015 1139.0980 1167.0625 1171.6325 1191.3565 1192.5963 1228.1070 1239.5599 1297.1646 1311.3875 1325.9411 1374.0977 1376.4667 1424.7566 1427.9549 1449.1386 1458.8061 1466.0465 1466.8714 1475.0415 1502.5049 1532.9913 1581.2206 1583.0079 1594.5345 1636.1787 2942.4610 3004.4329 3014.6696 3090.6852 3092.7099 3109.9712 3121.5371 3122.5290 3129.3167 3137.1287 3143.2880 3156.4287 3159.2439 3167.3408 3591.8868
redmass: 4.7333 4.3725 4.6983 4.4735 3.9686 4.9835 1.6754 4.6913 1.8540 2.9225 4.5948 2.3016 1.7060 2.3473 3.1687 6.1093 2.9586 5.0536 3.1810 2.7180 3.9844 6.3570 6.6791 4.5820 6.7414 2.1509 3.6562 1.5548 3.8446 1.2576 3.4089 2.2761 1.2632 1.3959 1.4345 1.3811 1.3573 1.3767 6.2639 1.3033 2.9192 3.2548 2.3652 2.5635 1.6151 1.4093 1.2779 1.1648 1.5293 1.0499 1.1273 1.1330 1.5678 1.7615 1.5734 1.3448 1.7183 6.3565 3.4461 3.3009 2.2540 1.2378 1.2764 1.0428 1.6506 1.7185 1.0905 3.1892 5.9917 4.9137 5.9416 6.4291 1.0378 1.1011 1.0565 1.1091 1.0956 1.0870 1.0891 1.0845 1.0879 1.0964 1.0935 1.0948 1.0943 1.1002 1.0774
irintensity: 0.4867 0.3376 1.6109 0.2801 3.9162 1.2111 4.3690 0.0430 0.6516 1.4515 3.3801 7.6659 40.9781 63.3781 0.2841 0.8310 0.1587 9.0276 12.1609 12.0665 25.4182 1.5017 2.3475 42.5574 24.3860 33.3922 3.6323 80.0831 3.1722 0.2473 19.1588 57.8977 0.7142 2.4947 0.3037 0.1717 0.0346 0.1164 1.2190 0.0583 0.0245 36.5859 10.8071 47.9509 8.9141 5.2970 1.7707 2.5707 11.4645 0.3782 10.6262 48.2242 2.2096 52.6085 16.2449 2.4850 48.3372 5.5895 58.8858 3.4334 7.2866 4.1246 36.0238 12.9600 38.8231 4.4474 29.1037 247.2762 8.2016 5.1198 85.3205 272.5180 116.8116 52.9864 20.5310 8.0356 29.1630 21.5859 17.6199 4.4468 2.9896 21.4141 22.4247 41.6243 16.3452 18.0080 49.8617
temp: 298.150 k
press: 1.00000 atm
elementType: 16 7 6 6 6 6 6 6 6 6 6 6 6 6 6 6 1 1 1 1 1 1 1 1 1 1 1 1 1 1 1
symmnumber: 1
zpe: 658229.7 jmol-1
zpe.correction: 0.250706 hartree
zpe.thermalcorrener: 0.266208 hartree
zpe.thermalcorrenthalpy: 0.267152 hartree
zpe.thermalcorrgfe: 0.205049 hartree
zpe.sumelectzpe: -994.149108 hartree
zpe.sumelectthermal: -994.133607 hartree
zpe.sumelectthermalent: -994.132663 hartree
zpe.sumelectthermalfe: -994.194766 hartree
dipole: 3.5974 0.8955 0.3697
dipole: 3.7256
quadrupole: -68.9467 -101.3967 -100.2697
quadrupole: -4.5949 1.2132 -1.2535
quadrupole: 21.2577 -11.1923 -10.0653 -4.5949 1.2132 -1.2535
hfenergy: -994.3998148 hartree
pointgroup: C01 [X(C14H15N1S1)]
dipole: 1.4109495 0.1257923 0.3766248 debye
polarizability: 324.5986473|1.7099019|124.1568513|-8.6636749|6.1900976|124.1967663 unknown
InChI: InChI=1S/C14H15NS/c1-15-13-9-7-12(8-10-13)11-16-14-5-3-2-4-6-14/h2-10,15H,11H2,1H3
charge 0 multiplicity 1
31 atoms
S  -1.209394 -0.510993 -0.808445
N  5.413234 -0.330629 -0.052784
C  1.205939 0.162839 0.464114
C  -0.278505 0.327314 0.650455
C  4.038621 -0.156312 0.104153
C  1.977131 1.148866 -0.200748
C  1.880102 -0.99477 0.940427
C  3.366994 1.005088 -0.382072
C  3.264209 -1.156464 0.770204
C  -2.971518 -0.268692 -0.354128
C  -3.407074 0.456923 0.782718
C  -3.934896 -0.853233 -1.219286
C  6.283553 0.632395 -0.720649
C  -4.789817 0.59307 1.047046
C  -5.311852 -0.710107 -0.948409
C  -5.749217 0.013765 0.187178
H  -0.635898 -0.16183 1.572235
H  -0.576499 1.388984 0.651567
H  1.479406 2.047178 -0.587004
H  1.306441 -1.779468 1.448743
H  3.927432 1.79011 -0.898888
H  3.760821 -2.058061 1.151569
H  5.826099 -1.188193 0.308094
H  -2.688496 0.919851 1.465634
H  -3.606243 -1.418097 -2.09934
H  5.995133 0.788606 -1.780491
H  7.320451 0.258085 -0.704165
H  6.271042 1.620077 -0.215806
H  -5.112687 1.15675 1.930012
H  -6.042682 -1.166689 -1.625594
H  -6.818829 0.122741 0.396262
