program: Gaussian 09
title: 000259412
version: EM64L-G09RevD.01
frameworkgroup: C1[X(C10H8BrNO3)]
method: RPBEPBE
basis: SDD
operation: Freq
keyword: #p
keyword: freq=noraman
keyword: PBEPBE/SDD
title: #p freq=noraman PBEPBE/SDD
converged: YES YES NO NO
title: Mulliken charges:
elementType: Br O O O N C C C C C C C C C C H H H H H H H H
charge: 0.073175 -0.418663 -0.380257 -0.246903 -0.014448 -0.207798 0.444399 -0.618256 -0.370071 -0.375971 -0.367508 -0.367945 0.294072 0.397448 -0.252186 0.276294 0.340137 0.263839 0.239889 0.260682 0.260230 0.374510 0.395333
chargesum: 0.00000
title: Mulliken charges with hydrogens summed into heavy atoms:
elementType: Br O O O N C C C C C C C C C C
charge: 0.073175 -0.044153 0.015076 -0.246903 -0.014448 0.068496 0.444399 -0.278119 -0.106233 -0.136082 -0.106826 -0.107716 0.294072 0.397448 -0.252186
polarizability: 2.21623305e+02 1.96065331e+01 9.96576309e+01 -1.10552621e+01 1.36556116e+01 1.04786167e+02
1716.lowfreq: -6.8235 -5.0383 -0.0006 -0.0003 0.0005 6.2776 21.9704 35.5519 53.8370
frequency: 21.5405 35.5091 53.8250 65.3465 108.1530 136.3274 140.0246 165.4190 222.1552 234.6080 249.8471 317.3659 385.2531 398.4376 429.6457 487.0757 521.6966 534.5980 549.4720 559.2612 570.7387 639.1929 653.1680 701.3392 710.6144 730.7948 767.9024 796.2643 841.6939 853.2256 870.6082 951.4736 972.6081 987.7078 1011.4878 1047.0443 1075.6401 1122.6851 1159.6182 1175.7830 1197.0566 1202.0327 1210.5192 1255.4943 1296.8321 1312.6292 1360.0167 1366.9129 1405.7283 1408.2961 1493.4901 1567.5249 1615.5717 1626.3331 2180.4218 3038.5299 3116.6967 3121.8521 3155.4558 3164.7048 3177.1495 3416.4842 3509.8385
redmass: 4.3053 9.0992 9.7955 10.0157 9.2361 9.6167 9.5930 12.5314 6.1722 7.3966 8.3206 8.4258 6.3783 2.8543 6.2433 4.8337 3.9773 2.2680 5.3361 1.6918 2.5477 6.9104 1.5473 4.1254 5.8589 4.4581 4.5154 5.4673 2.1682 1.3957 2.2996 3.1928 1.3991 1.4011 2.9490 4.6102 2.0146 1.4086 1.2290 2.2187 1.5421 1.9137 1.5036 1.3403 1.4481 1.3631 2.1743 3.5370 1.8665 1.7883 2.4428 6.9177 6.2049 8.0123 12.6318 1.0854 1.0873 1.0893 1.0890 1.0956 1.0964 1.0661 1.0642
irintensity: 0.1274 2.3245 1.2922 0.5750 2.5351 1.8339 3.4814 0.6411 5.3753 1.6670 1.5237 4.9237 1.9575 0.1452 3.7184 7.9711 31.5886 100.7234 4.1525 53.2152 37.5055 0.6851 265.4994 3.3566 2.6137 3.6204 5.8424 4.5622 36.2526 0.4083 23.1006 57.6640 1.6702 2.2450 7.8088 64.9509 266.5773 6.4896 10.1697 9.3797 4.9839 7.9641 14.7567 0.9896 11.2239 2.6667 79.4867 13.8331 8.2121 46.2856 13.6914 0.2350 7.1050 172.5396 33.3772 8.7989 5.0395 7.3825 1.8930 4.8713 1.6590 109.2986 44.1084
temp: 298.150 k
press: 1.00000 atm
elementType: 35 8 8 8 7 6 6 6 6 6 6 6 6 6 6 1 1 1 1 1 1 1 1
symmnumber: 1
zpe: 421412.8 jmol-1
zpe.correction: 0.160508 hartree
zpe.thermalcorrener: 0.174790 hartree
zpe.thermalcorrenthalpy: 0.175734 hartree
zpe.thermalcorrgfe: 0.116293 hartree
zpe.sumelectzpe: -678.654573 hartree
zpe.sumelectthermal: -678.640291 hartree
zpe.sumelectthermalent: -678.639347 hartree
zpe.sumelectthermalfe: -678.698788 hartree
dipole: -2.7922 0.9267 -2.0530
dipole: 3.5875
quadrupole: -133.8905 -86.6547 -98.2382
quadrupole: -4.1533 7.8170 2.7567
quadrupole: -27.6294 19.6064 8.0229 -4.1533 7.8170 2.7567
hfenergy: -678.815081 hartree
pointgroup: C01 [X(C10H8Br1N1O3)]
dipole: 1.0433918 0.4005095 0.8620018 debye
dipolederiv: -0.6218987 0.0942591 -0.1239463 0.1488559 -0.1902525 0.0532082 -0.1313961 0.0377584 -0.0753636 -0.7795187 -0.0128397 0.0793126 -0.0561307 -0.3109803 0.0158615 0.1013934 -0.014418 -0.646396 -0.3634764 0.0346346 -0.015862 -0.0345812 -0.6766968 -0.5299267 -0.0786179 -0.4979992 -0.8004286 -0.3374041 -0.0618475 0.0703235 -0.0763206 -0.6659694 0.1702391 -0.145371 -0.1177435 -0.9294591 -0.4651181 0.0450393 -0.0016233 0.0628094 -0.2498982 -0.0085591 0.0127142 -0.0114394 -0.2265953 0.3784786 0.0392311 -0.1842135 0.2600385 0.2080349 -0.0026845 -0.1447799 0.0339713 0.5353645 0.1266283 -0.0088035 0.0327733 -0.203367 -0.0259511 -0.0899947 -0.114699 -0.0393631 -0.1051142 0.8844983 -0.1487123 0.1663745 -0.1001798 -0.0912593 -0.0469588 0.2472465 -0.0005023 -0.0550676 -0.2052199 0.0584379 -0.1316259 0.0029094 -0.1128464 -0.0111867 -0.0918699 -0.0283211 -0.0027265 -0.2055947 -0.0576052 0.0972709 -0.0500605 -0.0589883 -0.0974801 0.0347749 -0.0946369 -0.0245667 0.035147 -0.0913534 0.0738264 0.0025748 -0.0651367 -0.1001042 -0.045906 -0.0694934 0.0268135 0.0355826 0.0081842 -0.0946387 -0.046149 -0.0792159 -0.047199 0.0141925 -0.0831514 0.0113259 0.141215 0.0238835 -0.0786733 -0.0346043 1.2583639 0.1669189 0.1666044 0.3638084 1.3834693 -0.0790488 0.0354161 -0.0040759 0.0473799 0.1066793 -0.004758 0.0120119 -0.0107469 0.1231441 0.4412317 -0.0991501 -0.0053226 -0.1223982 0.03101 0.0360984 -0.019522 0.0398918 -0.0381779 -0.0095033 0.0155281 0.0227895 -0.0138311 -0.044833 0.0505771 0.0115209 0.0348053 0.030481 -0.0210744 0.0126123 0.0424317 0.04957 0.0504344 -0.0132228 0.0417268 0.0079545 0.011939 0.0915577 -0.0151465 0.0773407 -0.0290665 0.1232152 0.0414408 0.0669512 0.0491846 0.0500008 0.0480821 0.0731789 -0.0617104 0.0742524 0.0706733 0.0828983 -0.0639551 0.0832543 0.018859 0.0526304 0.049118 -0.0437552 0.0643428 0.1005098 0.0803966 -0.0326465 0.0776271 0.037224 0.0323219 -0.0119575 0.0737113 -0.0011553 0.129597 0.0561962 0.0767877 0.0580297 0.0289702 0.4231915 0.0414131 -0.0138842 0.072268 0.2666544 0.0941489 0.0442139 0.0406437 0.3786002 0.3972918 -0.0235206 0.0231768 -0.0171568 0.2268556 0.1040904 0.038625 0.1408857 0.267704 unknown
polarizability: 216.9996367|-31.0848805|100.0078347|4.8495065|-15.0151152|109.0596322 unknown
InChI: InChI=1S/C10H8BrNO3/c11-8(10(14)15)9(13)7-3-1-6(5-12)2-4-7/h1-4,8-9,13-14H
charge 0 multiplicity 1
23 atoms
Br 4.181566 -1.095542 0.996431
O  2.082008 -1.054537 -1.629547
O  2.392293 1.891141 1.5641
O  2.53352 1.554303 -0.728845
N  -5.261377 0.628381 0.054724
C  1.509764 -1.184855 -0.305863
C  0.022468 -0.783225 -0.241142
C  2.283616 -0.38167 0.779756
C  -0.571983 -0.021795 -1.275095
C  -0.77055 -1.188657 0.86365
C  -1.930304 0.344765 -1.203587
C  -2.129107 -0.831244 0.945449
C  2.41936 1.093506 0.435449
C  -2.718987 -0.053311 -0.08956
C  -4.108031 0.319218 -0.012357
H  1.60132 -2.255626 -0.050293
H  1.838217 -0.504455 1.776608
H  0.02545 0.257043 -2.147537
H  -0.332454 -1.804501 1.659205
H  -2.387816 0.931215 -2.006399
H  -2.738569 -1.15123 1.796149
H  2.365492 -0.106033 -1.763015
H  2.511806 2.848908 1.316718
