program: Gaussian 09
title: 000259421
version: EM64L-G09RevD.01
frameworkgroup: C1[X(C17H15NS)]
method: RPBEPBE
basis: SDD
operation: Freq
keyword: #p
keyword: freq=noraman
keyword: PBEPBE/SDD
title: #p freq=noraman PBEPBE/SDD
converged: YES YES NO NO
title: Mulliken charges:
elementType: S N C C C C C C C C C C C C C C C C C H H H H H H H H H H H H H H H
charge: 0.162224 -0.662197 0.249706 0.223420 0.430051 0.269209 -0.895015 -0.457218 -0.402352 -0.431201 -0.439295 -0.258918 -0.256948 -0.153385 -0.256256 -0.171284 -0.212634 -0.250340 -0.239683 0.278914 0.298862 0.235790 0.226336 0.217504 0.238405 0.223687 0.226633 0.327452 0.299653 0.243339 0.249515 0.228622 0.227018 0.230385
chargesum: 0.00000
title: Mulliken charges with hydrogens summed into heavy atoms:
elementType: S N C C C C C C C C C C C C C C C C C
charge: 0.162224 -0.035092 0.249706 0.223420 0.430051 0.269209 -0.317239 -0.221428 -0.176016 -0.213697 -0.200890 -0.035231 -0.030315 -0.153385 -0.012916 0.078231 0.015988 -0.023322 -0.009298
polarizability: 3.32505631e+02 -1.43824270e+01 2.10943766e+02 -7.31838716e+00 -6.37366401e+00 1.28057849e+02
1716.lowfreq: -6.9426 -3.8790 -0.0015 -0.0006 0.0003 4.0318 15.6531 30.8263 48.1904
frequency: 15.4994 30.8175 48.1764 70.4887 102.8916 129.2271 147.7301 184.4997 217.0764 274.3748 305.2899 325.2920 346.5477 399.9883 406.7872 414.4186 432.3242 441.4898 467.9806 473.6776 511.7916 516.3674 527.2879 550.2442 587.9330 611.7474 637.2331 672.9881 682.9463 693.7307 710.4722 733.5212 742.8743 753.9900 797.6560 820.9455 835.0036 855.2946 867.3941 873.7838 898.7298 944.3323 965.2485 966.3412 971.3867 983.5938 984.0688 987.9187 1018.7105 1033.0437 1040.0069 1072.3639 1081.3331 1103.3385 1152.9484 1162.9344 1172.4793 1175.7736 1191.6518 1208.4749 1236.5360 1242.5161 1273.5579 1311.4050 1324.5807 1374.2460 1374.9091 1406.0127 1423.9219 1427.1893 1440.3777 1462.1380 1469.8804 1477.5634 1525.7356 1578.2103 1583.1246 1592.8333 1610.7529 1633.5252 1645.5873 3012.4714 3108.7438 3115.2203 3118.7608 3125.3709 3128.3819 3132.2432 3141.0483 3145.6302 3146.0781 3158.7082 3162.1615 3169.4881 3487.7336 3648.9831
redmass: 5.1580 4.4581 4.7367 6.1715 5.4707 4.3427 5.4700 5.1091 4.3106 4.6544 3.9508 3.9719 2.6732 3.1535 6.1259 3.7023 5.5882 1.1651 3.4306 3.3301 2.3835 3.7943 1.9313 2.3715 6.2969 6.4181 4.2825 6.6826 4.7951 2.1996 4.1909 4.7313 1.5656 1.3566 2.4865 1.6036 1.2756 3.4347 2.0820 1.8938 1.3771 1.3415 1.4265 1.4130 2.0090 1.3471 5.8271 1.3232 3.3221 2.1896 2.2001 2.5182 1.6239 1.6840 1.2795 1.1777 1.0506 1.0999 1.1225 1.8328 1.8055 1.1882 1.7585 1.3397 2.6439 6.2260 2.3994 4.3185 3.7428 2.2023 3.3208 1.7331 1.3841 2.7632 3.5769 7.5898 6.0299 5.8649 5.0433 4.1419 1.3357 1.0619 1.1022 1.0863 1.0861 1.0847 1.0877 1.0880 1.0978 1.0935 1.0939 1.0950 1.1003 1.1002 1.0494 1.0989
irintensity: 0.1983 0.0401 0.2660 1.3519 0.0460 3.0992 3.7850 0.1113 2.6999 0.9829 4.3449 6.0919 1.8164 0.1215 1.3231 3.4639 2.7481 40.0220 10.7437 9.9392 82.3899 34.7678 73.1355 46.7419 33.8153 0.0228 11.7279 29.3893 8.3481 29.3322 5.1078 9.6624 74.2797 40.8438 2.3903 86.1609 0.7633 4.3455 1.1197 3.4064 1.1516 0.6675 4.2386 0.4114 15.5723 0.4729 1.6937 0.1277 37.1565 4.2332 13.8906 36.7438 9.4454 10.5460 0.5593 13.2686 0.3128 1.4469 0.2729 22.2814 14.0482 20.8237 2.0292 1.8711 51.5125 3.4769 0.8413 10.5965 23.6455 8.0103 39.3560 74.2006 1.1978 24.5404 48.4215 10.4431 6.1875 68.9225 9.1286 34.8079 204.5004 13.7232 3.8263 6.6135 6.1515 3.9092 3.5069 2.2238 31.6987 21.9369 43.4227 37.4740 32.2929 15.4509 98.8342 52.7832
temp: 298.150 k
press: 1.00000 atm
elementType: 16 7 6 6 6 6 6 6 6 6 6 6 6 6 6 6 6 6 6 1 1 1 1 1 1 1 1 1 1 1 1 1 1 1
symmnumber: 1
zpe: 709075.0 jmol-1
zpe.correction: 0.270072 hartree
zpe.thermalcorrener: 0.286290 hartree
zpe.thermalcorrenthalpy: 0.287235 hartree
zpe.thermalcorrgfe: 0.224454 hartree
zpe.sumelectzpe: -1108.320414 hartree
zpe.sumelectthermal: -1108.304196 hartree
zpe.sumelectthermalent: -1108.303252 hartree
zpe.sumelectthermalfe: -1108.366032 hartree
dipole: -0.8004 1.7682 0.9633
dipole: 2.1669
quadrupole: -104.5470 -105.3659 -122.0488
quadrupole: 1.6931 -1.8858 -3.4435
quadrupole: 6.1069 5.2880 -11.3949 1.6931 -1.8858 -3.4435
hfenergy: -1108.5904864 hartree
pointgroup: C01 [X(C17H15N1S1)]
dipole: 0.2863243 -0.6424416 0.4817384 debye
polarizability: 330.5571896|-21.2943708|213.0365516|3.137235|-7.6509891|127.9135038 unknown
InChI: InChI=1S/C17H15NS/c18-17-11-10-13-6-4-5-9-15(13)16(17)12-19-14-7-2-1-3-8-14/h1-11H,12,18H2
charge 0 multiplicity 1
34 atoms
S  1.400627 -0.46334 -1.048746
N  -0.324801 -2.711225 0.796937
C  -1.062784 -0.416738 0.36851
C  -2.138628 0.501152 0.074604
C  -3.511956 0.031537 0.122777
C  -1.354063 -1.788227 0.595973
C  0.361133 0.040893 0.502452
C  -3.764258 -1.346055 0.432102
C  -1.921113 1.88083 -0.265589
C  -2.720369 -2.236001 0.647209
C  -4.587117 0.939379 -0.139675
C  -2.99067 2.744081 -0.522346
C  -4.339764 2.277769 -0.453805
C  3.128622 -0.171587 -0.483842
C  4.161506 -0.702942 -1.299195
C  3.461548 0.561106 0.681208
C  5.513553 -0.498974 -0.94931
C  4.819364 0.75233 1.028179
C  5.850605 0.227028 0.218142
H  0.447461 1.130667 0.613115
H  0.85329 -0.45517 1.358101
H  -4.802335 -1.696573 0.477359
H  -0.900182 2.265747 -0.355535
H  -2.925271 -3.294061 0.852026
H  -5.615909 0.561524 -0.093586
H  -2.793119 3.788788 -0.788161
H  -5.167857 2.96545 -0.655759
H  0.599602 -2.514171 0.408072
H  -0.56054 -3.686107 0.968541
H  3.908632 -1.272659 -2.200644
H  2.683915 0.992246 1.318646
H  6.30219 -0.912261 -1.588056
H  5.066024 1.319864 1.932696
H  6.900364 0.3807 0.489901
