program: Gaussian 09
title: 000259431
version: EM64L-G09RevD.01
frameworkgroup: C1[X(C13H18N4O3)]
method: RPBEPBE
basis: SDD
operation: Freq
keyword: #p
keyword: freq=noraman
keyword: PBEPBE/SDD
title: #p freq=noraman PBEPBE/SDD
converged: YES YES NO NO
title: Mulliken charges:
elementType: O O O N N N N C C C C C C C C C C C C C H H H H H H H H H H H H H H H H H H
charge: -0.241975 -0.225502 -0.219556 0.001578 -0.433851 -0.484728 0.018816 -0.392327 -0.406885 -0.392130 -0.369757 -0.351145 -0.394873 0.316982 0.500194 -0.423520 -0.308385 -0.346896 -0.363272 0.389326 0.190806 0.207805 0.199098 0.206735 0.205637 0.216285 0.203445 0.189734 0.166832 0.240862 0.216142 0.229022 0.252599 0.291631 0.225542 0.315023 0.285504 0.285202
chargesum: 0.00000
title: Mulliken charges with hydrogens summed into heavy atoms:
elementType: O O O N N N N C C C C C C C C C C C C C
charge: -0.241975 -0.225502 -0.219556 0.001578 -0.181253 -0.193097 0.018816 0.006285 -0.001052 0.029793 0.023422 0.056549 0.050290 0.316982 0.500194 -0.197978 0.006639 -0.061392 -0.078070 0.389326
polarizability: 3.34971552e+02 3.79943726e+00 1.64882976e+02 2.54141489e+00 -1.61587788e+01 1.13990667e+02
1716.lowfreq: -17.6173 -2.7521 -0.0009 -0.0006 -0.0005 2.5064 9.6055 25.8649 30.4816
frequency: -7.7279 25.4003 29.8603 57.9570 63.3291 71.0244 84.1082 112.4204 134.4359 171.2100 193.5378 227.9157 257.1089 289.7515 295.9098 319.2952 339.5192 364.0909 367.6382 416.0431 421.0444 431.0917 469.4917 492.3946 507.9601 510.1431 530.0896 602.1885 622.1713 638.2678 667.2159 706.3998 707.5257 735.3259 756.8641 771.6978 800.6296 802.1082 829.5780 836.3157 849.5154 860.1491 876.6070 941.5729 958.6241 968.6760 975.9274 982.4265 996.8075 1007.4027 1008.2837 1057.8257 1096.6320 1100.8603 1117.4818 1118.6519 1133.8107 1153.1671 1176.1019 1183.1892 1197.9794 1209.7507 1228.4118 1242.0545 1269.7291 1278.2866 1290.9278 1298.7879 1312.6898 1334.5205 1340.9087 1346.6853 1349.5611 1353.6279 1360.9556 1372.1125 1385.1032 1433.6216 1448.4708 1456.0552 1461.4235 1464.9487 1474.0020 1482.2970 1486.9131 1501.1424 1509.7299 1594.0348 1616.1985 1670.0608 2855.3136 2959.9868 2961.3712 2962.4586 2984.1630 2987.5683 3011.7070 3021.3958 3021.8468 3032.2483 3045.0331 3068.1467 3122.6692 3177.2324 3184.1938 3200.4838 3309.6656 3506.0995
redmass: 4.1908 4.8990 4.5452 5.3974 6.3600 4.2476 6.2794 3.8853 5.4674 5.5927 3.3747 3.7506 2.4404 3.8834 4.5853 2.4442 3.6652 2.6237 2.1087 3.0299 4.5113 2.4168 1.7913 2.1446 3.4720 4.1083 2.8860 1.2529 6.5534 5.7315 4.7490 8.2048 3.7104 4.7420 5.9829 6.4286 3.8663 1.4367 1.3951 2.3546 2.1840 2.4202 1.4978 2.1711 2.3657 2.3165 1.3384 2.0315 3.1184 2.4889 1.3209 2.1070 3.0153 2.0271 1.3087 2.5677 1.7689 1.7035 1.5877 1.7957 1.4151 1.6464 4.3885 1.5419 1.1758 1.8097 1.4324 1.4779 1.4579 1.4006 1.4848 1.2985 6.0995 1.4401 1.3725 1.3730 5.1213 5.1006 1.0884 1.0969 1.0826 1.1065 1.1566 1.1685 2.2475 1.2167 2.4857 6.2047 6.0708 5.8810 1.0720 1.0607 1.0617 1.0660 1.0653 1.0654 1.0888 1.0980 1.0949 1.1003 1.1007 1.0976 1.0906 1.0904 1.0945 1.0960 1.0748 1.0755
irintensity: 0.3435 0.5213 0.2361 0.0899 5.3045 0.7697 4.1798 9.1466 0.2783 0.3720 1.7737 3.5847 2.6634 0.9124 1.4489 2.6257 0.8682 16.1697 6.1691 0.1485 3.2271 12.6192 2.2214 7.3486 24.8160 18.7331 5.6042 104.3484 2.4778 2.6261 27.5418 6.4959 1.6976 5.9440 11.2676 9.3962 20.8999 5.6771 27.6621 14.7992 4.7553 5.0381 67.3468 17.4154 10.2981 5.1009 1.2311 20.0412 0.2278 0.8129 0.1595 3.6055 2.2701 101.1668 36.8699 117.0218 210.8631 72.7387 365.7991 11.6226 100.3775 88.6509 422.9432 11.4731 5.8745 16.2284 7.8427 62.1763 1.2311 4.6492 0.8947 14.1687 85.4282 1.7019 3.3719 6.2494 265.3251 23.2182 12.8800 5.0576 9.5203 3.9237 50.1844 38.4764 0.4481 79.2071 589.0837 55.4693 259.0293 207.3396 78.6209 33.2292 27.4892 28.2262 10.4849 22.9820 52.6193 59.7105 51.7434 78.3975 68.4244 26.1470 15.7415 2.5598 2.9210 5.8590 144.8131 19.9406
temp: 298.150 k
press: 1.00000 atm
elementType: 8 8 8 7 7 7 7 6 6 6 6 6 6 6 6 6 6 6 6 6 1 1 1 1 1 1 1 1 1 1 1 1 1 1 1 1 1 1
symmnumber: 1
zpe: 803922.5 jmol-1
zpe.correction: 0.306198 hartree
zpe.thermalcorrener: 0.324162 hartree
zpe.thermalcorrenthalpy: 0.325106 hartree
zpe.thermalcorrgfe: 0.258545 hartree
zpe.sumelectzpe: -949.254894 hartree
zpe.sumelectthermal: -949.236930 hartree
zpe.sumelectthermalent: -949.235986 hartree
zpe.sumelectthermalfe: -949.302547 hartree
dipole: 10.0414 4.5481 -1.9840
dipole: 11.2005
quadrupole: -159.0685 -114.1638 -117.7421
quadrupole: -1.8405 -1.4531 0.2023
quadrupole: -28.7437 16.1610 12.5827 -1.8405 -1.4531 0.2023
hfenergy: -949.561092 hartree
pointgroup: C01 [X(C13H18N4O3)]
dipole: 4.0424167 -1.7537277 0.0385535 debye
polarizability: 334.6368805|5.501874|169.3917634|-7.7652871|4.1220797|109.8165511 unknown
InChI: InChI=1S/C13H18N4O3/c18-13(15-16-9-3-1-2-4-10-16)14-11-5-7-12(8-6-11)17(19)20/h5-8,14-15H,1-4,9-10H2
charge 0 multiplicity 1
38 atoms
O  0.482101 1.460134 -0.180192
O  -6.696886 -1.265531 0.214607
O  -6.494876 1.008747 0.260893
N  3.122581 0.420614 -0.118383
N  1.96722 -0.371198 -0.090585
N  -0.330771 -0.762637 -0.087323
N  -5.987858 -0.180897 0.20483
C  6.303879 0.181946 0.827765
C  6.401221 -0.176401 -0.674114
C  5.164963 1.160339 1.21514
C  5.107983 -0.754675 -1.296335
C  3.753647 0.535708 1.222379
C  3.944666 0.275656 -1.346703
C  0.693271 0.223001 -0.119834
C  -1.722554 -0.558053 -0.020188
C  -2.554756 -1.718328 -0.009074
C  -2.321544 0.735228 0.039487
C  -3.948762 -1.601329 0.063509
C  -3.718787 0.85108 0.114006
C  -4.524144 -0.310773 0.126313
H  6.180081 -0.749044 1.420136
H  7.271802 0.621117 1.141228
H  6.682363 0.732347 -1.246386
H  7.230071 -0.899406 -0.810496
H  5.355556 1.522024 2.244182
H  5.176962 2.058973 0.567909
H  5.330191 -1.075329 -2.33379
H  4.790097 -1.666595 -0.74836
H  3.824209 -0.470195 1.709868
H  3.07624 1.148438 1.847164
H  4.363886 1.268358 -1.603876
H  3.23162 0.019541 -2.149255
H  2.052704 -1.375256 0.141627
H  -0.035011 -1.741032 -0.140442
H  -2.099328 -2.715396 -0.057087
H  -1.682485 1.619069 0.019623
H  -4.599156 -2.479532 0.073153
H  -4.199199 1.831984 0.161306
