program: Gaussian 09
title: 000259425
version: EM64L-G09RevD.01
frameworkgroup: C1[X(C17H20N2)]
method: RPBEPBE
basis: SDD
operation: Freq
keyword: #pfreq=noraman
keyword: PBEPBE/SDD
title: #p freq=noraman PBEPBE/SDD
converged: YES YES NO NO
title: Mulliken charges:
elementType: N N C C C C C C C C C C C C C C C C C H H H H H H H H H H H H H H H H H H H H
charge: -0.083042 -0.012306 -0.365992 -0.387009 -0.386619 -0.404142 -0.379355 -0.431945 -0.388192 0.288979 0.206620 0.408295 -0.407576 -0.376823 -0.460384 -0.237952 -0.432044 -0.262052 -0.251304 0.204593 0.184527 0.203300 0.221417 0.218299 0.203530 0.211972 0.214071 0.240270 0.197250 0.223991 0.228026 0.196514 0.265885 0.210297 0.234926 0.221811 0.234399 0.222383 0.225381
chargesum: 0.00000
title: Mulliken charges with hydrogens summed into heavy atoms:
elementType: N N C C C C C C C C C C C C C C C C C
charge: -0.083042 -0.012306 0.023128 0.037708 0.035210 0.021901 0.058165 0.020072 -0.191679 0.288979 0.206620 0.408295 -0.141691 -0.166526 -0.225458 -0.016141 -0.197645 -0.039669 -0.025923
polarizability: 3.34248554e+02 8.83821967e+00 2.20023129e+02 -2.30032399e+01 8.70020026e+00 1.14442354e+02
1716.lowfreq: -26.0578 -3.8788 -0.0005 -0.0005 -0.0005 7.5997 13.0943 31.3820 63.7892
frequency: -14.2550 30.9134 63.7271 69.7461 126.3900 140.1473 169.7116 179.8278 229.0549 253.3576 257.0378 291.6835 301.3601 337.4042 355.1926 407.5586 426.6027 445.5860 475.4965 479.2356 497.2290 522.2965 532.7788 561.3323 593.1875 631.5081 652.1844 723.5586 739.8824 740.5386 759.3272 784.2747 787.0240 807.1480 818.4794 841.8453 855.2813 859.7685 878.7503 881.0899 899.9469 925.7592 956.7974 960.4572 976.5789 984.8954 991.4522 1000.4879 1013.8304 1035.4654 1050.1027 1085.7350 1090.3469 1100.9764 1131.9661 1150.9792 1170.4682 1173.2779 1183.5677 1185.6285 1222.4195 1234.7997 1237.3760 1248.8496 1267.0239 1274.1757 1295.9928 1313.9775 1329.8832 1338.0251 1341.8653 1350.1514 1353.5568 1355.3827 1362.6093 1399.1200 1404.7256 1415.2090 1440.7660 1451.2327 1454.8611 1455.7901 1466.9831 1469.6396 1475.5539 1481.6417 1516.9598 1545.2897 1585.5712 1588.0105 1627.4458 2961.9680 2972.2287 2973.0063 2977.6199 2986.3297 2989.9800 3020.6938 3027.5206 3035.6548 3040.9955 3058.3514 3067.8007 3076.0137 3117.1551 3120.3186 3128.2348 3141.7044 3146.1769 3161.1474 3162.8340
redmass: 4.0243 3.7918 3.6137 3.9938 2.7275 2.7092 3.4519 3.7891 4.3370 2.9145 2.9746 3.3736 2.0424 4.2870 3.2929 3.2262 2.9327 2.3361 3.2803 2.9943 2.7213 5.3976 3.4281 3.0778 3.6985 5.1470 3.2097 2.6992 1.3702 1.4210 2.8180 5.4271 1.7834 1.4739 3.3483 2.3478 1.8226 1.5445 2.6684 2.7136 1.8775 1.3914 1.4043 2.0869 2.1359 1.3374 1.3761 2.1938 3.0281 2.2258 2.1049 2.0108 2.0703 2.0559 2.0388 1.4088 1.5436 1.1056 1.5299 1.2789 1.5492 1.8193 1.3097 1.6522 1.2162 1.9563 1.5069 1.3127 1.3314 1.3875 1.4112 1.3813 1.7070 1.4728 1.4183 2.5751 2.6470 3.5366 2.5523 1.1276 1.9187 1.1508 1.0977 1.1165 1.0876 1.1426 3.8524 4.5887 7.5428 5.1981 6.3686 1.0628 1.0612 1.0612 1.0615 1.0647 1.0657 1.1003 1.0959 1.1004 1.1011 1.0992 1.0862 1.1005 1.0857 1.0859 1.0881 1.0936 1.0938 1.0994 1.0967
irintensity: 0.1405 0.5280 0.4749 0.7384 0.8178 1.8681 0.8045 0.5987 3.1968 7.1014 2.5865 0.9695 3.6200 3.1024 4.5825 10.9351 11.0511 1.2316 0.8069 3.4219 5.3306 2.6103 13.2996 6.0418 3.5622 13.8409 0.2810 5.1865 2.5280 5.6898 6.0530 2.2531 95.5811 26.4677 20.1575 8.5149 9.9258 28.1289 11.5906 13.3583 39.4205 0.9709 1.8778 5.8262 1.2654 0.1691 3.5941 30.1798 15.8548 3.9219 0.9940 30.0616 0.2229 58.8654 25.7822 8.4057 23.8248 2.4994 18.8504 2.8934 34.1805 2.2841 1.0321 5.8675 0.0498 6.5906 4.5366 23.7287 4.6326 5.0642 3.8377 0.9174 4.7002 46.8910 5.6472 39.4669 4.2172 56.1582 0.7460 4.9898 3.3864 10.4067 8.8444 11.7194 13.3829 24.9833 28.1087 293.5250 0.7695 2.6611 1.5522 35.5831 19.8764 24.7975 38.9819 50.8317 69.8399 33.7562 46.5566 51.0710 63.8349 86.5269 20.8658 29.0460 2.7325 1.7881 4.1657 24.4320 54.4206 49.3417 4.2292
temp: 298.150 k
press: 1.00000 atm
elementType: 7 7 6 6 6 6 6 6 6 6 6 6 6 6 6 6 6 6 6 1 1 1 1 1 1 1 1 1 1 1 1 1 1 1 1 1 1 1 1
symmnumber: 1
zpe: 867572.9 jmol-1
zpe.correction: 0.330441 hartree
zpe.thermalcorrener: 0.345853 hartree
zpe.thermalcorrenthalpy: 0.346798 hartree
zpe.thermalcorrgfe: 0.287757 hartree
zpe.sumelectzpe: -767.900450 hartree
zpe.sumelectthermal: -767.885038 hartree
zpe.sumelectthermalent: -767.884094 hartree
zpe.sumelectthermalfe: -767.943134 hartree
dipole: 3.2408 -1.6233 -0.0024
dipole: 3.6247
quadrupole: -95.8937 -105.0122 -118.2109
quadrupole: -1.4170 -3.5139 3.0220
quadrupole: 10.4786 1.3600 -11.8386 -1.4170 -3.5139 3.0220
hfenergy: -768.2308912 hartree
pointgroup: C01 [X(C17H20N2)]
dipole: -1.2654188 0.6542953 0.0652268 debye
polarizability: 332.817456|2.6552813|219.909823|30.5680708|8.1119279|115.9867587 unknown
InChI: InChI=1S/C17H20N2/c1-2-6-13-19(12-5-1)18-14-16-10-7-9-15-8-3-4-11-17(15)16/h3-4,7-11,14H,1-2,5-6,12-13H2
charge 0 multiplicity 1
39 atoms
N  -2.691075 -0.106542 -1.087138
N  -1.496611 -0.69103 -0.777498
C  -4.827087 0.220616 1.056855
C  -3.572315 1.058532 1.436272
C  -4.488444 -1.131009 0.376743
C  -3.033842 2.005006 0.3318
C  -3.860368 -1.005481 -1.033519
C  -2.934948 1.351412 -1.082921
C  -0.404724 0.035955 -0.564274
C  0.881614 -0.62662 -0.305622
C  2.077062 0.146096 -0.00009
C  3.324754 -0.556787 0.250851
C  0.976154 -2.034962 -0.347438
C  2.09548 1.581242 0.071318
C  3.361647 -1.987408 0.198089
C  2.200708 -2.709563 -0.09621
C  4.510805 0.194132 0.552051
C  3.265807 2.285613 0.367242
C  4.489514 1.587534 0.610569
H  -5.398904 0.002481 1.979856
H  -5.504944 0.817685 0.410472
H  -3.796774 1.676944 2.327284
H  -2.766458 0.360683 1.738595
H  -3.785399 -1.68814 1.027166
H  -5.405389 -1.748903 0.287728
H  -3.696598 2.888565 0.242368
H  -2.045414 2.386626 0.652104
H  -3.528582 -1.996298 -1.387666
H  -4.615477 -0.618773 -1.745215
H  -3.885618 1.498513 -1.625075
H  -2.147479 1.851673 -1.681803
H  -0.428781 1.135134 -0.585414
H  0.07066 -2.602145 -0.583358
H  1.177764 2.15033 -0.106569
H  4.310392 -2.502476 0.389916
H  2.22949 -3.804283 -0.139235
H  5.442196 -0.354936 0.737442
H  3.247865 3.380421 0.413914
H  5.401711 2.148764 0.841509
