program: Gaussian 09
title: 000259408
version: EM64L-G09RevD.01
frameworkgroup: C1[X(C13H10N2O3)]
method: RPBEPBE
basis: SDD
operation: Freq
keyword: #p
keyword: freq=noraman
keyword: PBEPBE/SDD
title: #p freq=noraman PBEPBE/SDD
converged: YES YES NO NO
title: Mulliken charges:
elementType: O O O N N C C C C C C C C C C C C C H H H H H H H H H H
charge: -0.326505 -0.202952 -0.208771 -0.052298 0.020724 0.462602 0.444406 -0.291060 -0.503897 0.375754 -0.396864 -0.364992 -0.184042 -0.387889 -0.353576 -0.200441 -0.217485 -0.234550 0.243197 0.278275 0.317342 0.287782 0.241029 0.292370 0.248707 0.238400 0.236649 0.238084
chargesum: 0.00000
title: Mulliken charges with hydrogens summed into heavy atoms:
elementType: O O O N N C C C C C C C C C C C C C
charge: -0.326505 -0.202952 -0.208771 -0.052298 0.020724 0.462602 0.444406 -0.047863 -0.225622 0.375754 -0.079521 -0.077211 0.056987 -0.095519 -0.104869 0.037960 0.019164 0.003535
polarizability: 3.35962447e+02 -5.73748727e+00 1.77797505e+02 -6.78301034e+00 -5.03688263e+00 6.95618596e+01
1716.lowfreq: -5.5397 -0.0004 -0.0004 -0.0003 3.5843 7.7187 30.5039 41.4810 62.1393
frequency: 30.4540 41.4389 62.1355 69.5570 86.7071 156.5056 177.1635 186.7781 212.8713 273.5322 312.8626 336.9807 401.9448 405.1241 414.6552 430.3519 484.5486 513.7748 532.3826 582.5798 610.7779 638.4351 647.5763 683.0228 686.3335 690.1064 701.9995 763.1120 774.7591 802.0019 825.9302 843.3276 866.5844 896.0999 929.5354 935.2219 956.6676 977.9155 982.2683 988.9549 1000.0389 1012.6938 1022.6609 1063.3545 1085.0998 1086.3387 1093.6111 1154.7613 1173.6227 1175.1627 1186.6460 1214.9019 1244.6479 1301.0879 1316.3323 1369.6485 1373.9216 1391.5999 1401.8509 1430.9080 1447.4581 1465.0228 1474.2674 1539.6966 1567.1299 1601.7304 1604.0639 1610.9318 3137.0221 3146.2091 3152.8856 3157.6324 3161.1008 3170.9039 3177.2022 3185.7792 3186.9864 3195.9123
redmass: 4.2457 7.7438 8.1774 6.4346 6.9212 5.9130 5.7390 5.0888 7.1302 5.0381 4.9078 8.1857 8.6083 2.9524 4.2457 3.6541 5.2432 7.2525 4.3150 5.9808 6.4040 4.4386 7.4203 7.5082 2.1511 2.0039 4.9654 6.0239 1.7849 1.5092 1.4369 1.2587 6.6493 4.6467 1.4512 1.5900 1.3714 1.3871 6.1564 5.8623 1.3337 1.3580 2.3333 2.9669 1.5197 1.7862 1.8114 2.5551 1.1376 1.1369 1.1829 5.7942 2.7761 1.3890 1.3328 4.6604 4.9189 7.1991 3.2177 4.1444 2.2784 2.2622 2.3676 5.0807 6.0034 6.4152 6.5708 7.0425 1.0855 1.0893 1.0896 1.0943 1.0917 1.0987 1.0899 1.0966 1.0939 1.0959
irintensity: 0.5529 0.5292 3.0522 0.7486 5.9232 2.7136 0.4875 1.0223 0.5537 3.2041 0.8936 7.8831 3.0657 0.1263 2.3571 1.1881 6.1870 2.1833 15.8388 24.0606 1.4022 5.6437 10.6166 6.3391 26.5931 46.5056 9.6831 15.2318 80.4188 3.5587 51.2323 1.4410 15.2017 0.5224 3.9291 37.9811 0.2721 2.2759 0.7815 0.7218 1.4483 3.2850 8.8580 49.0332 8.6559 21.1791 25.4560 23.1108 22.4711 16.4910 19.5470 257.7268 41.1694 1.1049 0.6712 43.0275 60.6976 15.7422 14.7880 17.8087 20.5997 0.2455 45.5821 62.2854 0.7897 2.5508 3.7088 2.9572 1.0059 7.2820 12.4318 22.8215 3.3556 12.9458 7.7662 7.3665 7.1359 4.9596
temp: 298.150 k
press: 1.00000 atm
elementType: 8 8 8 7 7 6 6 6 6 6 6 6 6 6 6 6 6 6 1 1 1 1 1 1 1 1 1 1
symmnumber: 1
zpe: 538282.5 jmol-1
zpe.correction: 0.205021 hartree
zpe.thermalcorrener: 0.219616 hartree
zpe.thermalcorrenthalpy: 0.220561 hartree
zpe.thermalcorrgfe: 0.161508 hartree
zpe.sumelectzpe: -835.165956 hartree
zpe.sumelectthermal: -835.151360 hartree
zpe.sumelectthermalent: -835.150416 hartree
zpe.sumelectthermalfe: -835.209469 hartree
dipole: 5.5219 0.2030 0.1407
dipole: 5.5275
quadrupole: -107.9642 -102.7591 -106.0668
quadrupole: -22.0887 -3.8160 -3.6641
quadrupole: -2.3675 2.8376 -0.4701 -22.0887 -3.8160 -3.6641
hfenergy: -835.3709765 hartree
pointgroup: C01 [X(C13H10N2O3)]
dipole: 2.1645381 0.052003 -0.2031212 debye
polarizability: 333.4277171|-17.8336375|125.8921514|-21.143991|-52.9178373|124.0019426 unknown
InChI: InChI=1S/C13H10N2O3/c16-14(12-6-2-1-3-7-12)10-11-5-4-8-13(9-11)15(17)18/h1-10H
charge 0 multiplicity 1
28 atoms
O  1.441817 1.592841 -1.246135
O  -5.591163 -0.501533 1.058701
O  -3.951509 -1.865907 1.862223
N  1.486805 0.539925 -0.426401
N  -4.353371 -0.846804 1.177734
C  -0.978364 0.387129 -0.056028
C  2.833383 0.007781 -0.140849
C  0.395348 -0.049029 0.10817
C  -1.980367 -0.389096 0.600228
C  -3.330245 -0.021153 0.48512
C  -1.391371 1.528572 -0.81964
C  -3.749194 1.102944 -0.26311
C  -2.757845 1.868826 -0.910312
C  3.83105 0.234068 -1.113502
C  3.131456 -0.654611 1.07269
C  5.136654 -0.247474 -0.88427
C  4.443416 -1.127789 1.291473
C  5.446536 -0.932896 0.313932
H  0.58521 -0.952028 0.691736
H  -1.72141 -1.270566 1.195496
H  -0.624323 2.116784 -1.326154
H  -4.812364 1.348463 -0.323011
H  -3.053204 2.744364 -1.497489
H  3.565297 0.784592 -2.019352
H  2.375893 -0.772043 1.855847
H  5.912591 -0.085104 -1.639618
H  4.683787 -1.633818 2.232335
H  6.46279 -1.300539 0.490685
