program: Gaussian 09
title: 000259446
version: EM64L-G09RevD.01
frameworkgroup: C1[X(C10H16N2O4S2)]
method: RPBEPBE
basis: SDD
operation: Freq
keyword: #p
keyword: freq=noraman
keyword: PBEPBE/SDD
title: #p freq=noraman PBEPBE/SDD
converged: YES YES NO NO
title: Mulliken charges:
elementType: S S O O O O N N C C C C C C C C C C H H H H H H H H H H H H H H H H
charge: 0.251014 0.250228 -0.273072 -0.272885 -0.143765 -0.143502 -0.352649 -0.352719 -0.364279 -0.364231 -0.647276 -0.647198 0.262103 0.261802 -0.125206 -0.125183 -0.764006 -0.763892 0.270136 0.261162 0.270424 0.261328 0.294487 0.300764 0.294620 0.299934 0.308302 0.308233 0.211128 0.256214 0.255331 0.211125 0.256271 0.255257
chargesum: 0.00000
title: Mulliken charges with hydrogens summed into heavy atoms:
elementType: S S O O O O N N C C C C C C C C C C
charge: 0.251014 0.250228 -0.273072 -0.272885 -0.143765 -0.143502 -0.044347 -0.044487 0.167019 0.167522 -0.052025 -0.052644 0.262103 0.261802 -0.125206 -0.125183 -0.041333 -0.041238
polarizability: 2.74176424e+02 -6.86129114e-02 1.19217614e+02 -9.17707014e+00 -1.12957485e-01 1.49214143e+02
1716.lowfreq: -5.0922 -4.9200 -0.0018 -0.0018 -0.0006 4.8153 7.9203 17.8611 19.4785
frequency: 7.8139 16.2990 19.4489 27.9297 29.1482 36.4094 49.2624 63.2153 69.0211 71.5270 81.6252 94.9887 95.2764 154.6298 177.8804 202.3498 243.6629 264.7067 269.1526 319.2034 322.3760 394.3106 399.7667 403.8752 418.4695 460.1147 468.0341 491.9940 533.6566 537.3308 581.0245 582.0368 606.1849 606.3053 626.6145 627.0458 629.6352 682.7414 740.9674 796.7936 797.9868 889.5696 890.3955 955.5443 956.0525 989.3478 989.7528 1034.0157 1035.8142 1043.4746 1044.0002 1058.2749 1113.9237 1114.1443 1188.5406 1189.2600 1242.2209 1242.4559 1264.0154 1265.2226 1306.7892 1307.6780 1363.8803 1364.2173 1388.4680 1388.7387 1415.6916 1415.9676 1434.9049 1435.5500 1449.0998 1449.2100 1466.5794 1466.6958 1486.4321 1487.6371 1584.8473 1596.0177 1619.3092 1619.7221 2997.9127 2997.9490 3015.0594 3015.0681 3042.1314 3042.3330 3083.2393 3083.6218 3098.9380 3099.2296 3101.9359 3102.2296 3128.4182 3128.6187 3567.1479 3568.3041
redmass: 5.7676 5.9392 5.4725 4.7913 4.3888 9.2860 6.4622 5.2442 1.4212 1.2350 3.1391 4.0301 3.8627 4.8361 4.7206 5.6388 4.3355 6.7761 4.1438 2.2015 2.3374 9.4862 3.9426 2.8493 6.1625 2.3858 2.3360 6.2894 1.4686 1.4071 4.0452 4.1135 3.0358 3.0813 3.9770 3.4301 7.9355 12.2340 11.4071 2.2493 2.2650 2.4858 2.5027 2.1066 2.0967 1.8449 1.8474 2.0652 1.8731 1.7300 1.7002 6.9312 3.7235 3.7254 1.1626 1.1615 1.3806 1.3790 1.6939 1.6958 1.2000 1.1975 1.2759 1.2765 1.2271 1.2266 1.0917 1.0909 1.1402 1.1363 1.0454 1.0454 1.0990 1.0966 1.7916 1.8156 11.3345 11.6619 6.2144 6.2548 1.0360 1.0361 1.0601 1.0600 1.0587 1.0587 1.1033 1.1032 1.0989 1.0988 1.0999 1.0998 1.1071 1.1071 1.0784 1.0785
irintensity: 0.8420 8.3910 8.3246 3.2742 1.2459 1.2949 9.8224 1.8434 3.1572 4.1597 0.8456 2.6647 2.6680 8.3058 0.3224 0.4984 0.0737 0.0288 64.3302 0.0192 1.4059 0.5818 5.9442 10.3708 6.4529 3.9571 9.5697 15.6937 80.1724 164.2273 3.7070 6.7779 0.4465 1.1328 1.9030 6.5657 0.0160 12.8856 424.6585 36.2154 4.1724 1.4636 15.2831 3.0272 2.8809 3.7941 17.9474 5.4318 20.3160 13.0307 3.6935 0.4187 6.6985 11.9812 7.1915 0.2770 6.4646 6.5489 266.5395 23.1536 17.8117 8.4990 50.7491 4.7855 72.0192 47.9419 25.7837 16.2956 90.1081 8.0939 13.9832 15.7652 117.8089 7.9640 390.7840 25.1526 1.4125 288.5014 277.6175 88.6561 9.4894 9.5243 2.4858 30.3599 5.6258 7.5997 4.1306 4.4611 13.3129 12.7686 16.3510 15.6987 1.3120 0.7996 15.6982 14.8789
temp: 298.150 k
press: 1.00000 atm
elementType: 16 16 8 8 8 8 7 7 6 6 6 6 6 6 6 6 6 6 1 1 1 1 1 1 1 1 1 1 1 1 1 1 1 1
symmnumber: 1
zpe: 679636.9 jmol-1
zpe.correction: 0.258860 hartree
zpe.thermalcorrener: 0.281057 hartree
zpe.thermalcorrenthalpy: 0.282001 hartree
zpe.thermalcorrgfe: 0.199529 hartree
zpe.sumelectzpe: -1595.818141 hartree
zpe.sumelectthermal: -1595.795944 hartree
zpe.sumelectthermalent: -1595.795000 hartree
zpe.sumelectthermalfe: -1595.877472 hartree
dipole: 0.0132 3.7027 0.0538
dipole: 3.7031
quadrupole: -164.3547 -110.4584 -125.6053
quadrupole: 0.3148 -18.5581 0.0883
quadrupole: -30.8819 23.0144 7.8675 0.3148 -18.5581 0.0883
hfenergy: -1596.0770006 hartree
pointgroup: C01 [X(C10H16N2O4S2)]
dipole: -0.0066916 0.0245816 1.4566772 debye
polarizability: 274.0437439|10.0378927|149.3459024|0.1914573|-0.1740446|119.2185344 unknown
InChI: InChI=1S/C10H16N2O4S2/c1-7(13)11-3-5-17-9(15)10(16)18-6-4-12-8(2)14/h11-12H,3-6H2,1-2H3
charge 0 multiplicity 1
34 atoms
S  -2.129545 -0.698504 -1.291097
S  2.127341 0.683225 -1.297865
O  -6.529174 0.501194 0.225905
O  6.534167 -0.522587 0.257887
O  -0.693791 1.643456 -1.10402
O  0.691528 -1.656606 -1.08544
N  -4.371303 0.103539 0.982245
N  4.37163 -0.090865 0.982708
C  -3.789089 1.152041 0.135582
C  3.787734 -1.149685 0.15028
C  -3.444861 0.670742 -1.2869
C  3.442422 -0.686393 -1.277806
C  -5.735536 -0.160828 0.962542
C  5.738467 0.160851 0.97231
C  -0.655914 0.39359 -1.168079
C  0.653436 -0.407605 -1.16329
C  -6.20804 -1.28015 1.884432
C  6.211002 1.294818 1.87617
H  -4.542886 1.955278 0.039244
H  -2.893321 1.570219 0.625645
H  4.54162 -1.953971 0.064325
H  2.892088 -1.561351 0.646165
H  -3.043617 1.502178 -1.889859
H  -4.324274 0.228872 -1.78078
H  3.039956 -1.52509 -1.869805
H  4.32116 -0.250849 -1.778501
H  -3.750555 -0.482082 1.541424
H  3.750646 0.511374 1.523816
H  -5.389191 -1.773169 2.436381
H  -6.928846 -0.867153 2.611237
H  -6.744895 -2.037168 1.287818
H  5.391255 1.803102 2.412731
H  6.924353 0.891638 2.615678
H  6.756431 2.037241 1.269017
