program: Gaussian 09
title: 000259418
version: EM64L-G09RevD.01
frameworkgroup: C1[X(C13H11Cl2NS)]
method: RPBEPBE
basis: SDD
operation: Freq
keyword: #p
keyword: freq=noraman
keyword: PBEPBE/SDD
title: #p freq=noraman PBEPBE/SDD
converged: YES YES NO NO
title: Mulliken charges:
elementType: Cl Cl S N C C C C C C C C C C C C C H H H H H H H H H H H
charge: -0.078632 -0.054681 0.181129 -0.327623 0.566905 -0.678824 -0.239447 -0.309702 -0.294611 -0.186730 -0.222065 -0.220496 -0.244560 -0.251662 -0.205025 -0.199429 -0.102484 0.273514 0.274474 0.312481 0.254458 0.250832 0.263682 0.253101 0.233037 0.234833 0.258201 0.259324
chargesum: 0.00000
title: Mulliken charges with hydrogens summed into heavy atoms:
elementType: Cl Cl S N C C C C C C C C C C C C C
charge: -0.078632 -0.054681 0.181129 -0.015142 0.566905 -0.130836 -0.239447 -0.309702 -0.040153 0.064103 0.041617 0.032605 -0.011523 -0.016829 0.053176 0.059895 -0.102484
polarizability: 2.57637287e+02 -2.67911242e+01 1.91017867e+02 1.28291588e+01 1.09299681e+01 1.15894372e+02
1716.lowfreq: -10.5791 -5.7942 -4.0486 0.0008 0.0013 0.0020 8.1664 29.2879 35.0396
frequency: -5.0734 29.2672 35.0250 54.8405 72.8891 117.8929 140.9802 189.2909 212.7636 231.6072 284.6413 295.6831 316.3281 344.0003 346.2009 382.4895 409.1710 436.8448 481.6787 494.0880 502.7495 524.1135 536.8501 579.1463 600.4794 619.5863 661.5116 696.6849 710.1999 714.5651 749.2186 784.5407 818.8851 826.9522 840.9983 926.9721 928.7367 943.1935 962.4251 972.7053 990.5678 1005.3122 1040.2992 1064.8307 1069.7592 1098.7292 1114.3529 1144.9968 1173.7922 1177.9921 1230.9499 1242.5924 1274.4212 1281.6909 1331.4258 1350.8290 1377.6596 1379.8796 1432.5028 1451.2788 1455.3419 1463.6076 1517.4133 1570.5511 1573.4695 1578.6019 1618.6336 3041.1085 3132.7081 3139.5886 3142.0557 3153.6976 3155.9387 3168.3243 3171.2302 3175.6413 3178.8804 3525.2122
redmass: 9.3177 10.4558 4.0860 6.7803 6.8602 9.2971 4.7973 9.2001 8.2681 4.4058 7.7825 4.8990 5.2453 4.9287 6.4734 7.6524 2.9256 3.2627 3.6989 4.2292 6.7177 2.4694 3.4486 2.5402 2.5137 7.1582 5.8205 4.0265 3.5053 6.7180 1.2960 4.1154 1.3703 1.3218 1.4120 1.3639 1.7028 1.3303 1.3631 1.3152 5.3849 7.1277 2.0924 6.7654 1.9921 1.3669 2.4642 1.7804 1.0794 1.1187 1.1742 1.2954 1.3840 1.2469 1.8357 4.6193 4.6501 4.2336 2.2775 1.8476 1.3657 1.9090 2.1789 7.3547 6.6567 4.6454 6.3991 1.0596 1.1083 1.0862 1.0893 1.0888 1.0899 1.0941 1.0959 1.0976 1.1004 1.0765
irintensity: 0.0217 0.2444 0.2271 0.4296 0.3917 0.3411 0.8044 0.7450 0.0586 4.8338 7.0938 3.1400 0.6962 2.3167 7.7358 5.9825 0.2670 10.8302 73.5531 8.2185 58.3248 12.9802 31.6050 18.9438 109.0010 1.2666 36.5982 0.3919 0.4471 9.0637 102.7463 3.5476 38.3363 22.8981 1.6667 2.2475 3.8760 0.5815 0.2073 0.1774 69.5486 51.8128 3.8988 12.4926 70.4149 9.2154 79.5177 81.2205 3.4471 1.4803 25.5552 138.1264 2.8810 1.7862 39.7953 2.2167 46.6034 15.1799 14.4183 89.9945 10.7432 26.2079 205.2595 2.3500 2.9296 4.8605 133.2245 22.9463 8.0284 1.4150 4.3035 1.4850 7.6548 8.4390 5.3638 0.7118 8.0350 70.8180
temp: 298.150 k
press: 1.00000 atm
elementType: 17 17 16 7 6 6 6 6 6 6 6 6 6 6 6 6 6 1 1 1 1 1 1 1 1 1 1 1
symmnumber: 1
zpe: 536956.2 jmol-1
zpe.correction: 0.204516 hartree
zpe.thermalcorrener: 0.219649 hartree
zpe.thermalcorrenthalpy: 0.220593 hartree
zpe.thermalcorrgfe: 0.160136 hartree
zpe.sumelectzpe: -1873.705975 hartree
zpe.sumelectthermal: -1873.690842 hartree
zpe.sumelectthermalent: -1873.689898 hartree
zpe.sumelectthermalfe: -1873.750355 hartree
dipole: 0.7304 -0.0439 -1.2640
dipole: 1.4605
quadrupole: -132.0719 -114.8641 -118.1674
quadrupole: 0.6576 1.5810 8.6119
quadrupole: -10.3707 6.8370 3.5337 0.6576 1.5810 8.6119
hfenergy: -1873.9104907 hartree
pointgroup: C01 [X(C13H11Cl2N1S1)]
dipole: -0.3626574 -0.3509075 0.27481 debye
polarizability: 217.287034|11.8193216|184.0590934|56.3591352|44.3907819|163.2033994 unknown
InChI: InChI=1S/C13H11Cl2NS/c14-10-5-7-11(8-6-10)17-9-16-13-4-2-1-3-12(13)15/h1-8,16H,9H2
charge 0 multiplicity 1
28 atoms
Cl -4.474393 -1.252144 -2.182119
Cl 4.044789 1.822179 2.863114
S  1.04863 -1.74219 -1.632928
N  -1.770242 -1.929985 -0.992137
C  -2.270722 -0.706929 -0.524848
C  -0.504234 -2.485594 -0.653366
C  1.87174 -0.743176 -0.329647
C  -3.542288 -0.237675 -0.962571
C  -1.571139 0.111444 0.407781
C  2.338263 -1.339754 0.869088
C  2.087811 0.640291 -0.551601
C  -4.112376 0.958998 -0.506779
C  -2.135737 1.313752 0.879658
C  -3.404236 1.747087 0.431472
C  2.990099 -0.560119 1.852513
C  2.759817 1.424343 0.412646
C  3.192624 0.811544 1.60578
H  -0.247741 -2.350662 0.409381
H  -0.479751 -3.552496 -0.917004
H  -2.294332 -2.359074 -1.758283
H  -0.574509 -0.184402 0.746259
H  2.219629 -2.416962 1.028811
H  1.718582 1.105132 -1.470906
H  -5.093945 1.269212 -0.876991
H  -1.57175 1.919988 1.596542
H  -3.839326 2.682704 0.795268
H  3.349107 -1.017897 2.77871
H  2.930027 2.491184 0.241756
