program: Gaussian 09
title: 000259481
version: EM64L-G09RevD.01
frameworkgroup: C1[X(C16H17BrN2O2S)]
method: RPBEPBE
basis: SDD
operation: Freq
keyword: #p
keyword: freq=noraman
keyword: PBEPBE/SDD
title: #p freq=noraman PBEPBE/SDD
converged: YES YES NO NO
title: Mulliken charges:
elementType: Br S O O N N C C C C C C C C C C C C C C C C H H H H H H H H H H H H H H H H H
charge: 0.044083 0.901261 -0.531127 -0.528564 -0.243066 -0.181361 -0.454036 -0.443649 -0.373815 -0.377034 0.476267 0.002717 -0.377020 -0.378755 -0.219201 -0.268370 -0.222256 -0.229035 -0.160040 -0.159477 -0.265746 -0.211147 0.252164 0.279158 0.242255 0.249337 0.244875 0.220526 0.223912 0.258024 0.216601 0.233107 0.281822 0.301767 0.220835 0.220339 0.263446 0.264179 0.227024
chargesum: 0.00000
title: Mulliken charges with hydrogens summed into heavy atoms:
elementType: Br S O O N N C C C C C C C C C C C C C C C C
charge: 0.044083 0.901261 -0.531127 -0.528564 -0.243066 -0.181361 0.077286 0.047943 0.091585 0.104903 0.476267 0.002717 -0.160419 -0.145647 0.062621 0.033397 -0.001421 -0.008696 0.103406 0.104702 -0.038722 -0.211147
polarizability: 3.96527256e+02 -5.34652448e+00 1.98006319e+02 -4.15912438e+00 -2.73328870e+01 1.52047986e+02
1716.lowfreq: -9.3710 -0.0008 -0.0001 0.0014 2.4184 5.3905 10.2443 18.0115 30.0759
frequency: 4.9699 17.8698 30.0601 41.1690 54.4203 91.0729 93.0079 107.1702 120.9554 176.8551 182.2669 208.3640 220.5154 230.7711 262.0463 267.0275 303.4226 317.6977 320.7010 345.3295 384.4521 393.8610 406.5519 408.5001 414.8606 428.1647 463.7810 483.2048 507.6306 515.7696 561.7612 610.8382 613.6481 634.9702 687.7423 692.4883 703.3117 711.8097 757.0458 790.0000 799.4820 815.5870 819.7809 823.8410 844.0809 876.2305 913.9179 919.6470 928.2162 957.2780 958.5431 977.8860 978.5466 978.8625 982.6626 1016.4487 1021.1177 1031.8778 1041.8858 1047.8371 1054.6265 1087.6564 1089.6066 1104.9101 1123.8194 1171.4684 1174.6563 1177.7041 1197.7706 1198.2878 1226.8529 1265.6309 1282.2541 1291.8459 1321.4749 1336.3427 1342.6273 1352.2085 1360.2059 1373.6149 1375.4279 1376.9119 1384.1901 1422.6336 1429.9937 1445.5249 1446.6168 1466.1018 1474.3604 1494.7292 1562.8487 1580.4922 1590.7212 1616.7827 2912.3140 2940.1814 2991.1897 3000.4211 3057.4479 3062.5138 3073.8841 3093.0899 3122.3742 3128.3849 3146.6110 3153.9616 3155.8188 3163.0504 3168.3774 3177.2812 3182.1283
redmass: 6.2978 6.6491 3.9853 5.7729 4.6352 5.8767 9.2764 3.6616 7.8815 5.6549 11.8479 4.9255 5.2363 6.6091 4.3410 4.3498 3.1132 3.9909 4.9630 5.4831 3.8580 3.0049 2.9340 2.9144 4.4140 3.3591 3.5092 5.2231 3.7641 2.9483 7.1859 7.1042 6.2128 2.2661 6.9083 1.8244 4.0921 3.9385 1.8655 13.2639 3.3951 1.5862 1.4250 1.3439 1.3314 1.4921 3.8238 6.1842 3.7027 1.3858 1.3536 1.3893 4.7173 4.1726 1.4992 2.3429 1.8539 2.1510 2.4553 7.4114 1.7917 1.8075 1.9311 1.3473 5.6115 1.0703 3.0757 1.1386 1.1144 1.1663 1.3831 1.2968 1.2293 1.2192 1.3457 1.2925 1.3310 1.4170 1.7886 2.7974 1.6189 10.6501 3.3468 1.0841 1.0845 2.5118 2.1012 1.0954 1.1202 2.2781 6.1203 5.9916 8.1959 6.0587 1.0724 1.0678 1.0611 1.0619 1.0930 1.1022 1.1010 1.0890 1.0842 1.0879 1.0925 1.0898 1.0939 1.0891 1.1006 1.0961 1.0977
irintensity: 0.0565 0.1427 0.0785 0.2062 1.7937 0.8596 2.2588 2.1756 1.9639 5.4762 2.3268 1.4790 9.1982 1.6117 0.5512 21.9793 4.5313 37.8740 17.7814 23.7178 0.6699 4.0710 0.4037 1.5125 5.0694 0.4450 15.5210 42.4759 57.1390 30.9595 62.0670 0.7146 0.6798 67.3789 68.4933 40.3394 8.8610 9.8399 73.4143 96.0672 21.8304 0.9075 5.3785 20.5572 32.7134 4.1028 56.9374 57.5333 23.6895 0.1358 0.0454 0.7662 60.8723 2.9354 6.9723 24.9175 7.4066 11.6684 1.6740 80.5262 0.9496 2.1624 9.3734 6.2162 14.7924 0.3038 5.0641 16.9174 21.1813 13.2552 189.8701 35.0395 1.7406 5.9277 0.8096 1.7428 4.9829 6.0989 37.3540 20.0162 39.6899 2.4303 20.8072 28.1230 9.2609 2.0358 66.2203 14.3963 74.5178 140.4230 36.5639 10.1708 0.9034 184.1595 49.9038 23.1055 11.4326 16.9859 19.5870 19.4419 2.5232 15.2995 12.6829 5.4967 35.9442 5.6159 39.0928 0.9012 10.9102 1.9722 3.1196
temp: 298.150 k
press: 1.00000 atm
elementType: 35 16 8 8 7 7 6 6 6 6 6 6 6 6 6 6 6 6 6 6 6 6 1 1 1 1 1 1 1 1 1 1 1 1 1 1 1 1 1
symmnumber: 1
zpe: 783731.9 jmol-1
zpe.correction: 0.298508 hartree
zpe.thermalcorrener: 0.319323 hartree
zpe.thermalcorrenthalpy: 0.320267 hartree
zpe.thermalcorrgfe: 0.244401 hartree
zpe.sumelectzpe: -1289.578774 hartree
zpe.sumelectthermal: -1289.557959 hartree
zpe.sumelectthermalent: -1289.557015 hartree
zpe.sumelectthermalfe: -1289.632881 hartree
dipole: 1.0710 -1.6741 -3.1058
dipole: 3.6872
quadrupole: -145.6395 -143.3892 -154.7251
quadrupole: -2.7139 2.0579 -12.5927
quadrupole: 2.2784 4.5287 -6.8071 -2.7139 2.0579 -12.5927
hfenergy: -1289.8772821 hartree
pointgroup: C01 [X(C16H17Br1N2O2S1)]
dipole: -0.27091 1.3559224 0.4387605 debye
polarizability: 390.4419023|-25.7321819|145.4426722|-27.3135084|-12.97848|210.6969862 unknown
InChI: InChI=1S/C16H17BrN2O2S/c17-14-6-8-16(9-7-14)22(20,21)19-12-10-18(11-13-19)15-4-2-1-3-5-15/h1-9H,10-13H2
charge 0 multiplicity 1
39 atoms
Br -7.320153 1.168479 1.62275
S  -1.505699 -1.041876 -0.593335
O  -0.967896 -2.087406 0.550675
O  -1.683122 -1.503985 -2.147772
N  -0.497245 0.604299 -0.677998
N  2.37795 0.186956 -0.243408
C  0.473348 0.540362 -1.810897
C  0.165316 0.890357 0.629554
C  1.745771 -0.272149 -1.50087
C  1.465341 0.096723 0.912264
C  3.778149 0.033488 -0.053229
C  -3.151517 -0.373161 0.038956
C  4.687168 0.300857 -1.12195
C  4.327661 -0.3471 1.207498
C  -3.944749 0.39933 -0.82479
C  -3.536844 -0.725174 1.341409
C  6.078278 0.189413 -0.933626
C  5.724687 -0.442282 1.387578
C  -5.192193 0.860234 -0.348187
C  -4.786278 -0.262843 1.815603
C  6.614877 -0.179302 0.323258
C  -5.591437 0.525912 0.965873
H  0.732065 1.595177 -2.026159
H  -0.052188 0.117494 -2.684922
H  -0.563865 0.728609 1.443923
H  0.398295 1.97265 0.593095
H  1.475411 -1.351681 -1.429058
H  2.450515 -0.16981 -2.339869
H  1.946841 0.555574 1.792798
H  1.209792 -0.956951 1.160675
H  4.30959 0.628039 -2.096564
H  3.671194 -0.599794 2.045491
H  -3.611753 0.629301 -1.841052
H  -2.888634 -1.359742 1.954831
H  6.749218 0.407476 -1.772766
H  6.115569 -0.741588 2.367178
H  -5.838565 1.465144 -0.989581
H  -5.123111 -0.518146 2.823826
H  7.697311 -0.260183 0.466294
