program: Gaussian 09
title: 000259405
version: EM64L-G09RevD.01
frameworkgroup: C1[X(C12H13ClN2O2)]
method: RPBEPBE
basis: SDD
operation: Freq
keyword: #p
keyword: freq=noraman
keyword: PBEPBE/SDD
title: #p freq=noraman PBEPBE/SDD
converged: YES YES NO NO
title: Mulliken charges:
elementType: Cl O O N N C C C C C C C C C C C C H H H H H H H H H H H H H
charge: -0.069343 -0.289343 -0.239359 -0.328005 0.038575 -0.391163 -0.431076 0.561061 -0.000573 -0.416271 -0.383564 0.179725 -0.086535 -0.206626 -0.246489 -0.251946 -0.665291 0.260983 0.250237 0.243715 0.318522 0.258377 0.255532 0.232687 0.258478 0.235828 0.216867 0.213642 0.231201 0.250155
chargesum: 0.00000
title: Mulliken charges with hydrogens summed into heavy atoms:
elementType: Cl O O N N C C C C C C C C C C C C
charge: -0.069343 -0.289343 -0.239359 -0.009483 0.038575 -0.130180 0.062876 0.561061 -0.000573 -0.157894 -0.128032 0.179725 -0.086535 0.026061 0.011990 0.200748 0.029708
polarizability: 1.80927601e+02 -2.60861391e+01 1.66631771e+02 5.31037928e+00 -8.44735613e+00 1.27783067e+02
1716.lowfreq: -7.6382 -5.7984 -0.0008 0.0016 0.0018 2.8193 11.5947 31.9800 41.4009
frequency: 11.1017 31.9710 41.3507 73.9602 81.9624 98.7777 132.8423 155.3748 171.0413 186.2926 218.6736 261.9746 285.4769 319.3837 330.4151 362.5962 383.6721 403.2028 425.1274 444.2789 484.2679 516.1077 583.5073 623.3450 670.6322 693.0310 709.8191 720.7795 789.1931 791.9188 804.1837 814.5753 831.4871 879.3206 898.4613 912.1782 933.4777 980.7902 985.2457 992.0088 1008.0759 1022.2017 1048.2217 1073.3447 1093.2284 1096.0510 1113.4735 1153.6223 1158.2513 1179.8392 1195.8780 1208.2977 1269.9721 1278.9235 1286.0128 1311.1891 1321.3223 1357.0788 1380.6899 1389.7838 1406.0002 1427.1945 1456.6196 1462.5056 1464.5360 1479.1931 1484.1643 1514.3585 1577.7280 1606.6378 1634.0731 2976.8285 2991.3483 3024.8917 3061.3948 3072.4596 3086.7611 3089.8746 3115.8566 3131.9429 3151.6162 3155.3176 3176.1715 3602.9328
redmass: 7.0850 4.3839 3.3546 5.1947 4.8145 4.8285 3.2003 4.8369 5.8185 4.5700 1.2603 4.0428 3.2905 4.0965 4.8809 5.4224 1.8599 7.5968 3.9456 3.3816 4.2477 2.3887 4.5081 6.0324 6.7515 2.7454 3.3485 5.4825 2.9256 1.8669 2.3565 1.7131 3.7948 2.0991 2.1888 1.5778 3.0492 1.3547 6.0617 2.4493 3.0743 2.3872 5.3292 2.1270 1.5951 2.1183 4.5776 1.4998 1.2845 1.0904 1.4005 1.8088 1.8613 1.1203 1.8289 1.3526 2.0297 1.4154 6.9331 1.2310 1.4401 2.4099 1.0950 1.0442 2.2913 1.1101 1.0529 6.5478 6.4489 6.6519 10.6298 1.0662 1.0360 1.0593 1.0872 1.0983 1.0976 1.1035 1.1053 1.0876 1.0934 1.0930 1.0974 1.0805
irintensity: 0.5662 2.1396 1.0273 2.8608 0.3888 2.9464 2.7406 1.6383 0.0746 0.7241 2.3106 11.3397 10.9510 2.5432 6.4148 25.9711 112.0250 2.2141 0.8410 6.2911 2.3389 47.5084 1.1353 4.4878 16.9232 33.2086 10.7539 8.5701 21.5635 22.8054 57.1915 11.1868 0.6009 25.7229 6.9024 2.4249 2.6226 0.5329 2.5755 26.1488 5.1541 7.3845 430.1890 26.6937 4.5740 12.6619 47.7992 30.1061 3.0928 0.0405 59.9754 17.6429 9.6742 3.1386 45.0685 3.3366 39.3221 2.9855 1.2043 22.1079 43.7487 22.5808 16.4248 16.9496 24.4996 10.7923 10.5786 147.0276 48.3254 27.2391 254.6781 58.1120 18.8239 38.6817 6.1557 20.7067 41.2458 1.3590 27.9731 3.9713 9.7130 0.8720 5.6352 86.8945
temp: 298.150 k
press: 1.00000 atm
elementType: 17 8 8 7 7 6 6 6 6 6 6 6 6 6 6 6 6 1 1 1 1 1 1 1 1 1 1 1 1 1
symmnumber: 1
zpe: 604889.8 jmol-1
zpe.correction: 0.230390 hartree
zpe.thermalcorrener: 0.246776 hartree
zpe.thermalcorrenthalpy: 0.247720 hartree
zpe.thermalcorrgfe: 0.183556 hartree
zpe.sumelectzpe: -1183.810455 hartree
zpe.sumelectthermal: -1183.794069 hartree
zpe.sumelectthermalent: -1183.793125 hartree
zpe.sumelectthermalfe: -1183.857289 hartree
dipole: -0.9612 -3.0800 -1.6116
dipole: 3.6066
quadrupole: -125.1619 -87.7106 -100.6639
quadrupole: -9.1895 -12.5784 -0.8784
quadrupole: -20.6497 16.8016 3.8482 -9.1895 -12.5784 -0.8784
hfenergy: -1184.0408449 hartree
pointgroup: C01 [X(C12H13Cl1N2O2)]
dipole: 0.1988569 -1.2709075 0.5989078 debye
polarizability: 181.2327379|22.566439|161.8122169|15.3627259|13.562948|132.2974834 unknown
InChI: InChI=1S/C12H13ClN2O2/c1-2-17-12(16)11-10(7-14-15-11)8-4-3-5-9(13)6-8/h3-6,10,14H,2,7H2,1H3
charge 0 multiplicity 1
30 atoms
Cl 4.344654 0.267626 1.598235
O  -0.988876 1.812387 0.750844
O  -2.62824 1.852277 -0.932456
N  -2.369954 -2.360316 -0.258222
N  -2.671225 -1.068036 -0.605897
C  -0.792807 -1.005735 0.894082
C  -1.390424 -2.457649 0.863363
C  0.619819 -0.914604 0.311217
C  -1.827857 -0.253254 0.030334
C  1.685877 -0.430923 1.107924
C  0.880661 -1.315932 -1.024858
C  -1.894818 1.203527 -0.148061
C  2.979357 -0.364936 0.558524
C  2.187857 -1.242762 -1.55178
C  3.259398 -0.764384 -0.761094
C  -0.89411 3.299487 0.672562
C  0.121131 3.721204 -0.394171
H  -0.778052 -0.603242 1.919454
H  -0.624423 -3.22388 0.659524
H  -1.907049 -2.704623 1.812268
H  -3.053694 -3.075503 -0.498317
H  1.503234 -0.098552 2.134733
H  0.058357 -1.676299 -1.653948
H  2.382009 -1.5520 -2.58441
H  4.275508 -0.70125 -1.16028
H  -1.897972 3.704324 0.452734
H  -0.576937 3.59542 1.68576
H  0.244342 4.820349 -0.379712
H  1.105378 3.259042 -0.204626
H  -0.224542 3.426237 -1.399024
