program: Gaussian 09
title: 000259501
version: EM64L-G09RevD.01
frameworkgroup: C1[X(C20H25N7O6)]
method: RPBEPBE
basis: SDD
operation: Freq
keyword: #p
keyword: freq=noraman
keyword: PBEPBE/SDD
title: #p freq=noraman PBEPBE/SDD
converged: YES YES NO NO
title: Mulliken charges:
elementType: O O O O O O N N N N N N N C C C C C C C C C C C C C C C C C C C C H H H H H H H H H H H H H H H H H H H H H H H H H
charge: -0.291418 -0.294521 -0.395622 -0.246055 -0.413583 -0.248991 -0.413059 -0.401149 -0.393258 -0.450701 -0.025502 -0.433564 -0.627013 -0.131340 -0.356519 -0.430291 -0.461504 0.100448 0.326985 -0.050480 0.478942 0.134012 -0.134330 -0.380576 -0.442903 -0.389403 0.287147 -0.355597 -0.360202 -0.508057 0.148860 0.127161 0.227430 0.221785 0.220338 0.232420 0.244505 0.216505 0.315879 0.209553 0.257681 0.286480 0.296511 0.300014 0.333343 0.207211 0.247817 0.220616 0.228534 0.330241 0.271386 0.210797 0.255304 0.287950 0.301712 0.348340 0.385714 0.374017
chargesum: 0.00000
title: Mulliken charges with hydrogens summed into heavy atoms:
elementType: O O O O O O N N N N N N N C C C C C C C C C C C C C C C C C C C C
charge: -0.291418 -0.294521 -0.009908 -0.246055 -0.039566 -0.248991 -0.097180 -0.114669 -0.096747 -0.150688 -0.025502 -0.103323 0.023039 0.090445 0.096239 0.030718 0.005731 0.100448 0.326985 -0.050480 0.478942 0.134012 0.199013 0.074452 -0.222287 -0.160869 0.287147 -0.084211 -0.149405 0.035197 0.148860 0.127161 0.227430
polarizability: 4.23531447e+02 4.24718919e+01 2.69020524e+02 6.04831830e+00 -8.59231748e-01 2.31196405e+02
1716.lowfreq: -13.5582 -7.1256 -3.4311 -0.0011 0.0008 0.0012 1.6769 12.0497 12.2329
frequency: -8.6979 11.0660 12.1497 22.9906 25.2917 37.7619 44.1827 49.0933 54.6182 65.7823 69.3735 84.0047 95.4886 102.9734 109.9331 143.9898 157.1257 173.2238 183.2143 189.5762 210.6022 222.8916 233.6288 238.8268 248.1254 254.0697 259.4879 270.1095 290.2595 304.8803 312.8763 329.6366 347.5770 387.7248 392.0181 411.3525 426.2293 437.9776 443.2468 457.8515 469.2342 470.6272 476.8663 482.9724 504.2552 507.2451 529.2139 532.2322 549.9741 561.9672 568.1475 576.0567 580.7558 593.9238 598.9628 603.3316 620.2025 628.5439 634.0853 638.1205 673.2191 684.5134 690.3096 710.6459 735.5056 754.9997 762.8134 781.7361 801.1791 807.3594 811.9033 819.9040 838.7013 852.0070 868.8192 919.6388 936.4808 938.8503 960.6355 965.1575 971.0877 982.2692 995.5993 1001.2083 1030.2595 1031.9638 1039.4421 1050.8176 1058.7619 1085.7773 1098.7264 1106.4680 1107.8809 1124.4226 1133.5628 1150.5408 1158.2649 1194.7780 1198.0557 1203.1894 1218.6973 1222.6507 1237.3962 1240.1075 1244.6474 1267.5872 1275.9108 1280.0708 1291.2503 1295.6440 1301.4725 1307.6485 1317.2042 1327.5164 1336.3090 1342.1201 1348.9384 1354.3607 1364.0875 1367.2849 1376.8396 1377.9973 1431.9804 1433.4101 1438.2429 1451.0832 1460.1450 1465.4944 1471.3523 1476.4245 1487.4997 1495.4972 1520.6447 1530.3816 1553.1884 1558.4690 1585.1883 1589.8382 1627.3351 1632.3934 1642.7182 1665.5049 1684.2065 2966.7282 2968.8953 2993.4261 2998.9658 2999.1743 3010.7248 3024.0607 3040.8791 3053.5976 3066.5733 3069.5148 3084.2195 3113.7938 3117.5979 3156.3381 3160.3084 3513.3987 3520.1174 3529.1391 3530.7923 3533.6629 3540.2935 3548.7623 3566.0392 3688.5725
redmass: 6.5789 6.5692 6.8941 7.7622 6.8505 6.5954 3.9548 8.6713 6.9623 6.6968 9.3679 5.4787 6.2244 4.0661 6.0043 4.8290 3.5220 3.2960 3.4468 4.2759 2.6599 2.5064 3.9461 1.7153 2.5632 2.4025 2.7938 4.9363 4.1722 4.9696 5.4608 3.1621 4.7587 3.2286 3.1881 2.8708 3.9380 1.6926 2.5858 2.0960 3.2837 3.1400 2.1408 1.9975 2.7894 1.6191 3.2279 1.2743 2.8825 3.2355 1.9714 6.8875 1.3654 3.1017 4.5082 2.8623 2.7490 1.5957 5.0328 5.6349 7.8377 3.8657 3.3889 3.6065 11.0619 4.5215 2.9496 2.3183 2.5220 1.3973 3.8191 3.8166 1.7062 3.2815 2.9340 2.2266 1.5593 2.7803 3.8440 2.2339 2.3724 1.3662 2.9215 2.7164 4.0665 2.0410 3.0025 2.7583 2.2498 3.0830 2.4321 2.3821 2.3285 2.4128 1.5437 1.9772 2.8937 1.2758 1.3730 1.2692 1.3664 1.3201 2.4395 1.2505 1.3334 1.6546 1.7235 1.8841 1.6400 1.7095 1.8289 1.3583 1.3468 1.7489 1.3185 1.4485 2.1186 1.4651 1.7998 2.1936 1.9138 2.0088 2.2530 1.1204 3.7339 1.1163 1.1505 1.5295 1.7744 1.4847 1.3062 1.5973 3.1944 3.6231 8.7727 3.9303 1.9462 5.3611 1.7913 5.7013 8.3426 8.0937 7.1424 1.0656 1.0648 1.0607 1.0629 1.0847 1.0658 1.0811 1.0959 1.0988 1.1030 1.0979 1.0979 1.0886 1.0890 1.0932 1.0949 1.0641 1.0639 1.0759 1.0765 1.0765 1.0471 1.0771 1.0770 1.1037
irintensity: 2.0941 1.9545 1.3377 0.5862 1.0418 5.2848 2.5681 0.2284 1.1677 4.2042 1.6192 1.5016 7.4021 1.1098 0.1290 5.9570 0.9619 10.5406 26.9381 9.9027 11.9164 9.5246 14.8035 39.6977 31.5222 40.6251 49.1556 2.6390 0.8672 0.2179 5.6943 25.6541 5.3398 8.4913 8.6396 6.4229 13.0775 58.0258 48.5009 17.4696 39.5093 74.2853 66.0933 38.5745 6.0249 230.6058 36.2079 161.2138 30.2735 36.0000 36.8326 2.7189 122.0429 2.9342 22.0163 72.7517 27.4317 160.3876 6.8805 1.2156 8.8938 22.7901 65.9037 8.4874 12.5809 23.9083 8.3726 31.4730 7.0329 10.3222 21.9106 4.3349 52.4288 4.1342 1.9766 3.1114 1.3471 2.2139 2.1054 10.4503 13.9505 1.7250 1.3635 5.2693 4.0416 19.7322 291.2710 167.1682 19.9943 69.3495 55.1360 5.6290 65.6972 17.3519 51.7954 0.7648 7.8341 23.8792 2.8162 108.9128 6.7759 59.8969 33.7575 5.9507 25.4124 20.3099 16.3116 156.7768 89.1656 180.7756 10.2649 11.2150 64.1078 7.3956 98.4031 30.5886 274.5547 24.8008 26.5357 56.8988 26.0814 18.7981 149.0477 38.5388 11.7544 61.6827 7.3220 50.2527 44.4109 1.5513 221.0138 292.0758 190.3872 206.4524 418.2886 62.8279 103.9412 182.7219 633.9402 251.2551 189.3918 186.5302 219.9952 57.8191 33.2405 18.9443 17.9350 55.9780 28.8272 13.0667 2.6623 26.3532 59.3771 2.5917 17.4123 24.9637 12.6951 22.5074 8.1236 32.9525 25.3052 10.3561 52.9506 32.6095 85.4920 16.0538 55.0561 38.8288
temp: 298.150 k
press: 1.00000 atm
elementType: 8 8 8 8 8 8 7 7 7 7 7 7 7 6 6 6 6 6 6 6 6 6 6 6 6 6 6 6 6 6 6 6 6 1 1 1 1 1 1 1 1 1 1 1 1 1 1 1 1 1 1 1 1 1 1 1 1 1
symmnumber: 1
zpe: 1190091.1 jmol-1
zpe.correction: 0.453282 hartree
zpe.thermalcorrener: 0.484928 hartree
zpe.thermalcorrenthalpy: 0.485872 hartree
zpe.thermalcorrgfe: 0.386346 hartree
zpe.sumelectzpe: -1609.344486 hartree
zpe.sumelectthermal: -1609.312840 hartree
zpe.sumelectthermalent: -1609.311896 hartree
zpe.sumelectthermalfe: -1609.411422 hartree
dipole: -3.4041 5.4621 5.2412
dipole: 8.3002
quadrupole: -197.5007 -178.1452 -187.4819
quadrupole: -11.6063 -80.2751 -3.1660
quadrupole: -9.7915 9.5641 0.2274 -11.6063 -80.2751 -3.1660
hfenergy: -1609.7977679 hartree
pointgroup: C01 [X(C20H25N7O6)]
dipole: -1.4069327 -2.9448124 -0.1111566 debye
polarizability: 422.4333196|-39.947511|253.3690926|20.7336583|-18.8505515|247.945964 unknown
InChI: InChI=1S/C20H25N7O6/c21-20-26-16-15(18(31)27-20)24-12(9-23-16)7-8-22-11-3-1-10(2-4-11)17(30)25-13(19(32)33)5-6-14(28)29/h1-4,12-13,22-26,28,32H,5-9,21H2
charge 0 multiplicity 1
58 atoms
O  -7.039553 2.342122 0.886312
O  4.538378 0.163348 -1.820208
O  7.128512 -2.988644 1.15075
O  5.077863 -2.5361 2.135998
O  7.44505 1.832672 -2.561218
O  7.897569 -0.389848 -2.076436
N  -5.362191 0.214904 1.569253
N  -5.57814 -2.173547 0.077122
N  -1.623808 1.533301 -0.361788
N  -7.400574 -1.178732 -1.180016
N  -8.19908 1.048227 -0.723849
N  4.569696 -0.485555 0.407188
N  -9.192952 -0.244147 -2.418945
C  -4.205366 -0.688191 1.534285
C  -3.149663 -0.307088 0.456339
C  -4.749407 -2.13319 1.303931
C  -2.595792 1.126076 0.658856
C  -6.321055 0.094532 0.552067
C  -6.433802 -1.090469 -0.160186
C  -7.192002 1.239846 0.255838
C  -0.293848 1.131767 -0.410802
C  -8.258585 -0.09136 -1.399061
C  5.912535 -1.067529 0.327206
C  7.06146 -0.065004 0.676922
C  0.53143 1.54886 -1.503622
C  0.297563 0.314989 0.602313
C  2.473739 0.373133 -0.556276
C  1.876864 1.171057 -1.57191
C  1.654189 -0.046909 0.525171
C  7.118627 1.135054 -0.284369
C  3.91459 0.010828 -0.715256
C  5.957262 -2.251243 1.288062
C  7.514637 0.738396 -1.694034
H  -3.72409 -0.675188 2.532565
H  -2.317036 -1.036797 0.484814
H  -3.609693 -0.378346 -0.5467
H  -5.335433 -2.428514 2.197967
H  -3.909021 -2.83961 1.182536
H  -5.332191 1.132406 2.020758
H  -2.136035 1.217354 1.664279
H  -3.436891 1.842552 0.627665
H  -5.820901 -3.09394 -0.291729
H  -1.96927 2.099366 -1.13635
H  -7.345833 -1.935146 -1.86476
H  6.087891 -1.422106 -0.706233
H  6.913615 0.306135 1.709084
H  8.015545 -0.62007 0.642252
H  0.098009 2.172912 -2.295514
H  -0.301473 -0.038273 1.446948
H  4.065371 -0.635118 1.284059
H  2.505063 1.478444 -2.414456
H  2.05111 -0.697971 1.314457
H  7.858112 1.875675 0.078328
H  6.150918 1.661939 -0.339257
H  -9.527359 -1.157993 -2.716545
H  -9.779601 0.570212 -2.590189
H  7.128432 -3.741079 1.802825
H  7.660314 1.527799 -3.483838
