program: Gaussian 09
title: 000259361
version: EM64L-G09RevD.01
frameworkgroup: C1[X(C7H9N)]
method: RPBEPBE
basis: SDD
operation: Freq
keyword: #p
keyword: freq=noraman
keyword: PBEPBE/SDD
title: #p freq=noraman PBEPBE/SDD
converged: NO NO NO NO
title: Mulliken charges:
elementType: N C C C C C C C H H H H H H H H H
charge: -0.198375 -0.454387 -0.375418 -0.531499 0.397358 -0.250589 -0.436014 -0.278422 0.233992 0.233970 0.231380 0.231377 0.235212 0.235194 0.243541 0.246400 0.236282
chargesum: 0.00000
title: Mulliken charges with hydrogens summed into heavy atoms:
elementType: N C C C C C C C
charge: -0.198375 0.013575 0.087339 -0.061093 0.397358 -0.007048 -0.189614 -0.042140
polarizability: 9.41353711e+01 -2.71999031e-01 8.23670255e+01 2.57553706e-03 -3.90840446e-04 4.59007992e+01
1716.lowfreq: -126.9002 -13.7951 -0.0004 -0.0002 0.0007 11.9048 19.2343 167.4783 209.2253
frequency: -126.8458 167.4733 209.2175 416.2334 598.5888 603.7487 616.9912 699.6851 708.0576 760.0090 778.0876 778.3958 856.0873 900.6391 908.5144 915.2192 1017.4279 1021.7602 1053.9540 1066.6090 1137.4548 1164.3107 1199.3665 1203.6520 1235.9474 1252.5256 1279.5374 1303.8535 1309.3481 1393.6363 1425.9083 1464.7190 1474.2746 1488.0783 1506.6433 1555.3184 2987.5380 2990.5972 3030.1417 3030.4716 3034.9410 3090.3105 3194.4244 3211.6513 3232.2118
redmass: 1.6280 3.1414 3.0899 3.4814 5.2167 3.3153 3.6322 1.2215 5.9175 1.1351 4.5495 1.2688 1.3071 3.7891 3.1490 1.3315 1.4751 3.1737 1.7005 1.6196 2.5710 1.1960 1.1369 1.3388 1.0791 1.3981 1.9381 1.7329 2.0847 4.3639 3.7485 2.5062 1.1642 1.1337 1.1830 6.8396 1.0576 1.0597 1.1040 1.0620 1.1060 1.1055 1.0901 1.0979 1.1072
irintensity: 0.6695 3.1050 5.7075 2.1230 2.8028 3.9370 0.3233 102.8595 2.2732 0.1064 2.3919 39.0600 1.1391 3.6225 1.4524 0.6912 5.6380 0.5550 23.7033 0.0186 0.8710 0.4043 0.0322 3.1023 0.0104 8.4313 12.1612 26.2716 11.7121 7.7459 3.1533 27.3848 0.0719 5.8815 4.5458 6.0775 72.8024 43.0480 24.9789 61.6403 5.2032 46.1464 6.0391 5.9991 4.9462
temp: 298.150 k
press: 1.00000 atm
elementType: 7 6 6 6 6 6 6 6 1 1 1 1 1 1 1 1 1
symmnumber: 1
zpe: 378459.9 jmol-1
zpe.correction: 0.144148 hartree
zpe.thermalcorrener: 0.149909 hartree
zpe.thermalcorrenthalpy: 0.150854 hartree
zpe.thermalcorrgfe: 0.114313 hartree
zpe.sumelectzpe: -326.287515 hartree
zpe.sumelectthermal: -326.281754 hartree
zpe.sumelectthermalent: -326.280809 hartree
zpe.sumelectthermalfe: -326.317350 hartree
dipole: 2.5174 -0.8199 0.0003
dipole: 2.6475
quadrupole: -44.8849 -43.4086 -50.6117
quadrupole: -0.1221 -0.0002 -0.0005
quadrupole: 1.4168 2.8931 -4.3099 -0.1221 -0.0002 -0.0005
hfenergy: -326.431663 hartree
pointgroup: C01 [X(C7H9N1)]
dipole: 0.9893988 -0.3247311 -0.0244849 debye
dipolederiv: -0.6389846 0.3670071 0.0123476 0.3122148 -0.2725883 -0.0075028 0.012126 -0.0088937 -0.1300207 0.0949091 0.0129514 0.0016 -0.0080685 -0.0536235 0.0004069 0.0015409 -0.0001126 0.1561842 0.4621732 -0.282739 -0.0030445 -0.2031365 0.2815247 0.0051905 -0.0031461 0.0071065 0.323637 0.0359892 0.0826328 0.004308 0.0206755 0.0698005 -0.0003501 0.0041833 -0.0019439 0.2098882 0.1790746 -0.1087305 -0.0062568 -0.2443913 0.180552 0.0056626 -0.005717 0.0025174 -0.0785448 0.2505811 -0.1408382 -0.0118602 -0.0403808 -0.1338123 0.0007821 -0.011943 0.0031113 -0.2272231 -0.2142421 0.0190102 -0.0016213 0.0154652 -0.0292112 -0.0006986 -0.0015994 -0.0007676 -0.2741649 -0.107285 0.0658358 -0.0040876 0.0908295 0.0091292 -0.0026005 -0.0040322 -0.0020202 -0.2664968 -0.0347587 0.0039065 0.096252 0.0078351 0.0687026 -0.0090921 0.1529759 -0.0117254 -0.0626469 -0.0478439 0.0043075 -0.0970891 0.0079893 0.0688097 0.0084284 -0.1537815 0.0112676 -0.0497008 -0.0118578 0.0349081 0.0076785 0.0648054 -0.0529392 -0.0967591 0.0631301 -0.1512553 -0.0698047 -0.0156929 0.0426021 -0.0106347 0.0694479 -0.0522601 0.0933072 -0.066104 0.1492724 -0.0667873 -0.0065956 -0.0575628 0.0290137 -0.0452287 -0.0318294 0.0931474 0.0820645 0.1422837 -0.0529622 -0.0124998 -0.064729 -0.0309311 -0.0499313 -0.032115 -0.0907474 -0.0840601 -0.1392745 -0.0471016 0.086873 0.0014048 0.0035259 -0.0372037 -0.0551064 0.001326 0.0036138 0.0004611 0.2268292 0.0910072 0.0399392 0.0029785 0.0542046 -0.0715267 -0.000999 0.0029783 -0.0006792 0.2106272 -0.1108471 -0.0199062 0.007821 -0.0151265 0.1064935 0.0004985 0.0077705 0.0006523 0.198288 unknown
polarizability: 94.1035321|-0.2988024|82.3682245|-1.2142821|-0.0355694|45.9314392 unknown
InChI: InChI=1S/C7H9N/c1-3-7-4-2-6-8(7)5-1/h1,3,5H,2,4,6H2
charge 0 multiplicity 1
17 atoms
N  -0.050483 -0.662999 0.001377
C  2.25526 -0.043927 -0.058199
C  1.286372 -1.277255 -0.031807
C  1.367087 1.257513 -0.036514
C  -0.047111 0.732819 -0.00057
C  -1.356838 -1.143015 0.034691
C  -1.379209 1.166483 0.032298
C  -2.203987 -0.020506 0.054803
H  2.885802 -0.071495 -0.962767
H  2.931916 -0.069652 0.812463
H  1.401842 -1.914507 -0.928368
H  1.447533 -1.911977 0.859471
H  1.553381 1.883326 -0.929151
H  1.597851 1.884177 0.845101
H  -1.588174 -2.20667 0.041996
H  -1.727864 2.198739 0.039762
H  -3.293378 -0.050255 0.082311
