program: Gaussian 09
title: 000259360
version: EM64L-G09RevD.01
frameworkgroup: C1[X(C7H7N)]
method: RPBEPBE
basis: SDD
operation: Freq
keyword: #p
keyword: freq=noraman
keyword: PBEPBE/SDD
title: #p freq=noraman PBEPBE/SDD
converged: NO NO NO NO
title: Mulliken charges:
elementType: N C C C C C C C H H H H H H H
charge: -0.233011 -0.401234 0.451973 -0.244116 -0.355591 -0.232509 -0.429033 -0.275956 0.240571 0.240572 0.242430 0.257399 0.247087 0.251146 0.240269
chargesum: 0.00000
title: Mulliken charges with hydrogens summed into heavy atoms:
elementType: N C C C C C C C
charge: -0.233011 0.079910 0.451973 -0.001687 -0.098192 0.014578 -0.177887 -0.035686
polarizability: 1.11217662e+02 -3.68185276e+00 8.20650463e+01 -1.26204136e-03 2.08472399e-04 3.73472439e+01
1716.lowfreq: 0.0003 0.0006 0.0006 3.2420 10.9107 13.2488 178.1378 236.0019 430.8174
frequency: 178.1325 236.0014 430.8173 431.1122 595.0037 647.4178 654.9173 713.6112 715.7008 726.1101 787.1981 842.4125 863.9560 896.5019 926.1793 947.3328 960.0556 1016.7064 1044.9961 1082.2575 1150.4834 1161.5086 1208.3503 1248.9869 1289.1357 1318.0407 1365.2408 1407.4242 1442.1913 1472.6400 1535.9259 1580.8844 2985.0812 3031.6376 3184.1850 3198.8660 3211.8644 3215.2748 3233.0597
redmass: 4.8534 2.2665 2.5509 3.5256 3.0113 1.7834 5.8316 1.2644 5.8067 1.6720 1.4298 5.1918 1.3282 3.2511 1.3230 2.4319 1.6988 1.4923 1.5575 1.1997 1.0909 2.3414 1.3569 2.0025 2.0739 2.3784 4.1718 4.4111 1.5722 1.9336 5.4495 7.3311 1.0582 1.1036 1.0885 1.0899 1.1068 1.0974 1.1078
irintensity: 5.8160 0.8885 12.8224 3.2134 0.6458 62.4861 1.0134 110.6389 5.3453 0.7105 31.1117 1.6567 1.6191 0.4572 3.0739 17.7951 7.9254 4.1272 38.3807 0.1545 0.2024 7.6261 1.5838 21.6978 10.7130 17.4204 6.4042 12.7062 1.3041 17.6231 1.7707 10.7921 39.7492 17.1600 2.0212 4.5340 7.6987 4.5780 4.2782
temp: 298.150 k
press: 1.00000 atm
elementType: 7 6 6 6 6 6 6 6 1 1 1 1 1 1 1
symmnumber: 1
zpe: 316634.8 jmol-1
zpe.correction: 0.120600 hartree
zpe.thermalcorrener: 0.126465 hartree
zpe.thermalcorrenthalpy: 0.127409 hartree
zpe.thermalcorrgfe: 0.090909 hartree
zpe.sumelectzpe: -325.096308 hartree
zpe.sumelectthermal: -325.090443 hartree
zpe.sumelectthermalent: -325.089499 hartree
zpe.sumelectthermalfe: -325.125999 hartree
dipole: 1.5984 -1.2436 0.0002
dipole: 2.0252
quadrupole: -42.4652 -40.0102 -51.5032
quadrupole: -0.9064 0.0002 0.0000
quadrupole: 2.1944 4.6493 -6.8437 -0.9064 0.0002 0.0000
hfenergy: -325.2169081 hartree
pointgroup: C01 [X(C7H7N1)]
dipole: -0.615755 -0.5056561 -0.000074 debye
dipolederiv: -0.4784387 -0.304989 0.0000067 -0.3010509 -0.2557893 0.0001273 0.0000954 0.0002068 -0.1293912 0.2825238 0.2227766 -0.0000064 0.046176 0.0613284 -0.000003 -0.0000615 -0.0000562 0.3562993 -0.2007039 0.1924134 -0.000018 0.433324 0.0348961 -0.0001624 0.0000824 -0.0000793 -0.0087313 -0.3506471 0.0011099 -0.000004 -0.1780515 0.1318007 -0.0000215 -0.0000341 -0.0000079 -0.3340172 0.5511943 -0.1442159 0.0000365 -0.0672509 0.0532672 0.000023 0.0000246 0.0000237 -0.1279904 0.0069294 0.1384449 -0.0000795 0.0826582 -0.0231598 -0.0000434 -0.0000123 -0.0002172 -0.1962281 0.0669445 -0.0631547 0.0000106 -0.1105774 -0.0023994 0.0000206 -0.0000648 0.000065 -0.2624848 -0.0498408 -0.0437581 0.0000109 0.1583424 -0.0496073 0.0000416 -0.0000006 0.0000052 -0.2670859 0.0407636 -0.0124005 0.0165284 -0.07409 -0.0042109 0.089263 0.059868 0.1300863 -0.0259189 0.0407732 -0.0123634 -0.0164792 -0.0740751 -0.0042057 -0.089258 -0.0598428 -0.1300797 -0.0259224 -0.0737702 0.0069389 -0.0000095 0.0006065 0.0922617 0.0000075 0.000023 -0.000003 0.2010513 0.0788149 0.0355243 -0.0000049 0.0820383 -0.0446303 0.0000041 -0.0000318 -0.0000005 0.1848388 0.0878043 0.0023508 0.0000097 0.036326 -0.0463428 -0.0000066 -0.0000427 0.0000739 0.2176913 0.0975852 -0.0349178 0.0000049 -0.052 -0.0542984 0.0000088 -0.0000078 -0.0000189 0.2162961 -0.0999326 0.0162407 -0.0000063 0.0176243 0.1110899 -0.000001 0.0000051 0.0000017 0.2015933 unknown
polarizability: 111.0035091|4.4444682|82.2791993|-0.0012561|-0.0002416|37.3472439 unknown
InChI: InChI=1S/C7H7N/c1-3-7-4-2-6-8(7)5-1/h1-5H,6H2
charge 0 multiplicity 1
15 atoms
N  0.036009 -0.677797 0.000043
C  -1.331613 -1.232366 -0.000112
C  0.023642 0.732353 -0.000027
C  -2.183442 0.04021 -0.0002
C  -1.375274 1.151753 -0.000185
C  1.343414 -1.141089 -0.000266
C  1.358925 1.174127 -0.000231
C  2.184021 -0.008295 -0.000118
H  -1.512915 -1.85653 0.896351
H  -1.512678 -1.856502 -0.89664
H  -3.27456 0.010955 -0.000243
H  -1.703695 2.192371 -0.000226
H  1.592772 -2.200947 -0.000288
H  1.704097 2.207318 -0.000282
H  3.273595 -0.03496 -0.000077
