program: Gaussian 09
title: 000259399
version: EM64L-G09RevD.01
frameworkgroup: C1[X(C15H16N2O2)]
method: RPBEPBE
basis: SDD
operation: Freq
keyword: #p
keyword: freq=noraman
keyword: PBEPBE/SDD
title: #p freq=noraman PBEPBE/SDD
converged: YES YES NO NO
title: Mulliken charges:
elementType: O O N N C C C C C C C C C C C C C C C H H H H H H H H H H H H H H H H
charge: -0.265151 -0.265406 -0.021928 -0.590916 0.344216 0.247724 -0.064098 -0.387027 -0.396309 -0.373613 -0.351732 0.311398 0.316494 -0.369967 -0.357865 -0.360023 -0.353397 -0.538154 -0.537181 0.243513 0.266185 0.269223 0.260531 0.235513 0.241558 0.245286 0.252280 0.219024 0.219533 0.242481 0.222406 0.247023 0.220542 0.316130 0.311709
chargesum: 0.00000
title: Mulliken charges with hydrogens summed into heavy atoms:
elementType: O O N N C C C C C C C C C C C C C C C
charge: -0.265151 -0.265406 -0.021928 0.036923 0.344216 0.247724 -0.064098 -0.143514 -0.130124 -0.104390 -0.091200 0.311398 0.316494 -0.134454 -0.116308 -0.114737 -0.101117 0.142883 0.152790
polarizability: 2.89621405e+02 1.22028737e+01 2.05006325e+02 -9.91512632e+00 -3.99596751e+00 1.13910203e+02
1716.lowfreq: -10.2218 -0.0006 0.0003 0.0006 3.4452 7.4371 24.3755 39.3325 47.2849
frequency: 24.2573 39.3166 47.2427 64.8110 92.7170 110.3251 140.5690 145.7616 187.5896 200.7856 222.5307 234.5892 248.0358 267.1934 269.2523 333.0535 340.0162 361.5176 386.4537 414.5671 418.1105 436.5354 466.5289 492.7002 510.0114 539.3442 547.3699 586.4618 619.4158 622.1029 640.2624 658.5559 732.8115 738.7682 764.5650 781.7718 811.1577 820.3853 839.7533 845.1243 930.1048 942.6367 956.1667 971.5650 982.0131 985.7917 989.1788 1000.1166 1005.0036 1077.8655 1107.5723 1111.5508 1112.1369 1114.8278 1155.0305 1155.4757 1167.3769 1174.7527 1187.3874 1226.0343 1228.1660 1234.4346 1296.6860 1301.6385 1327.8110 1359.5783 1369.9348 1413.7422 1424.5557 1435.2776 1435.9884 1465.3531 1467.0714 1472.0497 1473.7364 1494.5867 1501.5139 1537.3601 1569.2415 1575.5325 1614.1271 1619.7755 1628.0226 2955.1547 2960.1596 3041.1074 3047.9530 3121.2262 3126.2123 3131.4681 3137.2101 3140.0906 3149.9271 3160.3322 3160.5326 3167.6277 3171.9090 3433.5627 3675.0146
redmass: 3.8024 4.6833 3.5505 4.4657 3.6907 3.9107 4.4487 4.4225 2.8071 3.4328 2.2042 1.4842 1.6531 3.5546 3.2238 1.3884 4.2203 3.5110 4.3544 2.9169 2.9398 4.8811 3.9341 3.0336 2.5934 1.5206 3.4865 4.5279 4.8240 5.4935 5.8636 4.3645 4.0593 4.2693 5.3352 5.8731 1.3286 1.3499 1.5406 1.5694 3.8140 1.3895 1.4424 1.3481 1.3518 8.5703 8.5536 2.9086 2.4011 4.0451 1.3635 1.2612 1.2610 1.3690 1.3295 1.3409 1.7836 1.2871 1.5497 3.0201 2.4046 2.3610 1.3462 1.2959 3.4470 5.6356 5.4555 3.8042 4.0990 1.1683 1.1825 1.0504 1.0501 1.0764 1.0794 2.3975 2.6835 8.0609 7.2328 7.2770 4.7611 6.0301 1.1911 1.0331 1.0330 1.1037 1.1039 1.0990 1.0990 1.0891 1.0874 1.0885 1.0877 1.0949 1.0944 1.0964 1.0968 1.0490 1.0967
irintensity: 0.5299 0.4343 3.4261 0.6830 2.5150 3.2296 4.6259 1.5743 3.5248 6.4849 3.7854 2.0189 2.4381 1.3791 3.9892 229.4977 21.5880 22.1585 8.0702 7.4881 6.1166 0.4527 2.5570 6.0226 7.5687 15.7274 17.8826 56.3425 3.2427 6.7765 6.8864 5.0141 0.3027 6.4150 2.9816 1.8361 17.7892 20.9124 46.6870 64.3024 29.2774 0.8660 3.3628 0.3240 2.0523 42.4542 47.6567 12.6473 10.9117 79.9897 11.3911 0.1611 0.2226 7.7990 10.3887 0.1068 129.1237 98.7938 4.0801 210.4484 98.4701 93.2573 3.3603 4.3934 38.1066 34.4787 25.8180 3.6975 12.7300 4.0647 11.5270 12.9747 13.3470 64.9828 60.3406 53.0359 180.6021 61.9721 3.9688 44.6661 76.4092 65.8351 16.6780 82.7092 70.7370 51.7480 46.7908 33.2404 29.0264 3.2303 18.3843 3.7395 4.0655 17.3469 13.8770 5.1604 7.3774 16.9351 58.0702
temp: 298.150 k
press: 1.00000 atm
elementType: 8 8 7 7 6 6 6 6 6 6 6 6 6 6 6 6 6 6 6 1 1 1 1 1 1 1 1 1 1 1 1 1 1 1 1
symmnumber: 1
zpe: 730802.2 jmol-1
zpe.correction: 0.278348 hartree
zpe.thermalcorrener: 0.296454 hartree
zpe.thermalcorrenthalpy: 0.297398 hartree
zpe.thermalcorrgfe: 0.231284 hartree
zpe.sumelectzpe: -839.717044 hartree
zpe.sumelectthermal: -839.698938 hartree
zpe.sumelectthermalent: -839.697994 hartree
zpe.sumelectthermalfe: -839.764108 hartree
dipole: 3.8275 -1.3095 -1.1247
dipole: 4.1988
quadrupole: -93.2397 -97.1357 -112.0193
quadrupole: 12.5933 -7.7572 3.7933
quadrupole: 7.5585 3.6626 -11.2211 12.5933 -7.7572 3.7933
hfenergy: -839.995392 hartree
pointgroup: C01 [X(C15H16N2O2)]
dipole: -1.4888349 0.5722229 -0.4299083 debye
polarizability: 288.4980945|9.9747309|202.3444791|18.2432748|16.105901|117.6953593 unknown
InChI: InChI=1S/C15H16N2O2/c1-18-13-7-3-11(4-8-13)15(17-16)12-5-9-14(19-2)10-6-12/h3-10H,16H2,1-2H3
charge 0 multiplicity 1
35 atoms
O  5.237905 1.045403 0.28493
O  -4.770802 1.737778 0.460142
N  0.036997 -2.667415 -0.410479
N  -1.148251 -3.349061 -0.507066
C  1.368468 -0.699728 -0.058398
C  -1.218165 -0.542706 -0.055083
C  0.041073 -1.352841 -0.188399
C  1.506486 0.712635 -0.099018
C  -2.16556 -0.477249 -1.109452
C  2.556351 -1.47803 0.099303
C  -1.507754 0.169037 1.144656
C  3.930127 0.543092 0.164087
C  -3.62484 0.966194 0.217234
C  2.769509 1.33779 0.011186
C  -3.360679 0.269037 -0.987922
C  3.815051 -0.871721 0.206491
C  -2.69223 0.912375 1.284948
C  5.405403 2.498333 0.242285
C  -5.760016 1.841163 -0.61567
H  0.617654 1.338631 -0.231447
H  -1.955796 -0.997887 -2.051056
H  2.462174 -2.567319 0.130198
H  -0.791009 0.133737 1.972455
H  2.831376 2.429658 -0.02905
H  -4.059846 0.305198 -1.828838
H  4.725632 -1.466685 0.328954
H  -2.91767 1.458984 2.205768
H  4.86232 2.992452 1.071965
H  5.060562 2.916146 -0.724112
H  6.486542 2.66794 0.354456
H  -5.324641 2.310513 -1.519366
H  -6.556745 2.482711 -0.211847
H  -6.176858 0.848892 -0.87708
H  -1.06098 -4.357856 -0.566728
H  -2.056787 -2.915207 -0.312049
