program: Gaussian 09
title: 000259340
version: EM64L-G09RevD.01
frameworkgroup: C1[X(C8H12N4O4)]
method: RPBEPBE
basis: SDD
operation: Freq
keyword: #p
keyword: freq=noraman
keyword: PBEPBE/SDD
title: #p freq=noraman PBEPBE/SDD
converged: YES YES NO NO
title: Mulliken charges:
elementType: O O O O N N N N C C C C C C C C H H H H H H H H H H H H
charge: -0.299165 -0.324413 -0.279084 -0.252081 -0.401716 -0.467223 -0.377364 -0.353931 -0.360079 0.304306 -0.253205 0.283287 0.107497 -0.228037 0.145343 -0.491091 0.233311 0.252606 0.199382 0.206345 0.321460 0.335790 0.332126 0.364853 0.350709 0.236283 0.207734 0.206359
chargesum: 0.00000
title: Mulliken charges with hydrogens summed into heavy atoms:
elementType: O O O O N N N N C C C C C C C C
charge: -0.299165 -0.324413 -0.279084 -0.252081 -0.080256 -0.131432 -0.012512 -0.003223 0.125838 0.304306 0.152522 0.283287 0.107497 0.104090 0.145343 0.159284
polarizability: 2.12274929e+02 9.25269898e+00 1.31256468e+02 -1.00733619e+01 -5.75033010e+00 7.03941561e+01
1716.lowfreq: -0.0008 -0.0008 -0.0004 2.8005 4.1240 12.4503 20.3137 38.9188 55.7013
frequency: 20.2753 38.9048 55.6952 77.5211 97.4731 106.6373 111.4781 158.0559 181.2900 213.5101 228.6907 254.4006 273.6721 308.5034 365.2367 369.0934 385.3138 405.0898 503.1145 516.3260 540.2045 557.9446 576.5850 635.7119 692.5587 702.6848 706.2202 713.3937 736.1173 751.4192 776.5585 801.0915 821.9339 895.8520 898.8783 946.4732 985.1237 1016.9750 1066.6808 1089.9541 1119.1480 1125.4222 1138.2742 1155.0339 1199.1232 1205.1642 1221.8306 1248.3475 1271.1565 1334.0775 1350.5770 1357.1461 1374.3280 1389.4114 1427.4019 1438.0423 1459.3112 1466.1081 1466.8081 1480.8134 1495.8735 1521.8972 1604.3200 1626.1634 1658.4980 1685.4982 2931.3564 2940.5877 2982.9345 3004.4254 3010.8465 3083.7432 3107.8873 3205.0599 3452.6415 3532.4143 3542.6374 3569.8687
redmass: 5.3498 4.4956 4.8016 3.5613 4.1704 5.0112 4.0000 5.9832 7.3733 1.4373 4.8275 4.9339 2.2109 5.6065 5.9411 6.1424 4.2683 3.5072 1.9408 7.0251 3.2911 2.0515 5.8768 1.2992 1.6593 1.3285 8.5183 4.5615 3.6219 5.6654 2.4768 3.0012 5.0224 2.7743 1.3012 3.0356 3.0397 3.3406 4.1469 1.7725 1.6544 2.1243 2.2766 1.4529 2.2629 1.5006 1.4214 1.5235 2.3572 2.4716 1.4422 1.5601 1.4143 3.0117 1.9101 1.1528 1.0514 1.0745 1.0851 1.0882 1.9597 2.8324 6.9456 4.7097 6.4702 5.9767 1.0398 1.0491 1.0809 1.0923 1.1033 1.0960 1.0979 1.0960 1.0763 1.0771 1.0774 1.0783
irintensity: 0.6354 0.3314 0.3949 4.8960 3.2367 11.9587 17.0974 0.0316 2.5220 1.9372 17.7559 2.0870 2.4200 5.7887 6.4731 30.2904 7.1864 6.1956 12.4478 14.9503 17.8938 41.5404 2.7734 65.8264 30.5549 145.6086 2.1454 2.7386 69.9237 7.6118 151.2627 2.3482 3.8137 4.0289 41.8687 11.5375 15.6685 17.6048 138.1388 2.5486 10.4347 32.2532 5.8796 26.3892 9.9079 8.5785 81.2207 188.6230 37.4367 37.6616 79.1425 31.2103 11.0750 201.9789 70.9319 6.8282 10.1035 53.1232 15.8439 17.0926 319.0381 695.0638 533.1672 35.9634 300.4572 503.2546 52.2265 98.4479 0.6920 145.8588 50.8384 7.1185 26.5108 7.8105 58.7219 65.2832 69.8172 89.6317
temp: 298.150 k
press: 1.00000 atm
elementType: 8 8 8 8 7 7 7 7 6 6 6 6 6 6 6 6 1 1 1 1 1 1 1 1 1 1 1 1
symmnumber: 1
zpe: 566831.5 jmol-1
zpe.correction: 0.215895 hartree
zpe.thermalcorrener: 0.231742 hartree
zpe.thermalcorrenthalpy: 0.232686 hartree
zpe.thermalcorrgfe: 0.170665 hartree
zpe.sumelectzpe: -830.786089 hartree
zpe.sumelectthermal: -830.770242 hartree
zpe.sumelectthermalent: -830.769298 hartree
zpe.sumelectthermalfe: -830.831319 hartree
dipole: 5.2969 -0.7059 1.1019
dipole: 5.4562
quadrupole: -90.8825 -95.2553 -94.1929
quadrupole: 6.3374 6.8088 0.6854
quadrupole: 2.5610 -1.8117 -0.7494 6.3374 6.8088 0.6854
hfenergy: -831.0019835 hartree
pointgroup: C01 [X(C8H12N4O4)]
dipole: 2.0808368 0.360254 -0.3851045 debye
polarizability: 211.9375199|-13.6336749|128.3445984|1.7012965|15.7130368|73.643435 unknown
InChI: InChI=1S/C8H12N4O4/c1-16-3-2-9-7(14)11-5-4-10-8(15)12-6(5)13/h4,9-12H,2-3H2,1H3
charge 0 multiplicity 1
28 atoms
O  4.831947 -0.787602 -0.326744
O  0.791648 1.859506 0.713065
O  -1.682625 -2.332599 -0.453275
O  -5.485387 0.410847 -0.148528
N  2.306568 0.093967 0.438131
N  0.015215 -0.288418 0.163728
N  -3.563472 -0.940259 -0.293978
N  -3.359017 1.329817 0.246587
C  3.495117 0.903249 0.722315
C  -1.358075 -0.004198 0.110742
C  4.568141 0.659738 -0.341626
C  1.031436 0.634223 0.456019
C  -2.177168 -1.181938 -0.230611
C  -1.96795 1.213089 0.339787
C  -4.233716 0.282299 -0.069919
C  5.810171 -1.196087 -1.333409
H  3.90848 0.647548 1.717767
H  3.186554 1.962364 0.738857
H  5.493339 1.224778 -0.09608
H  4.207072 0.970945 -1.345817
H  2.481975 -0.88519 0.201605
H  0.224558 -1.274982 -0.036165
H  -1.386216 2.099148 0.595342
H  -4.162746 -1.737777 -0.528326
H  -3.805875 2.232088 0.416766
H  5.926863 -2.286018 -1.228877
H  6.790845 -0.703593 -1.16561
H  5.460017 -0.958146 -2.360146
