program: Gaussian 09
title: 000259362
version: EM64L-G09RevD.01
frameworkgroup: C1[X(C18H17N)]
method: RPBEPBE
basis: SDD
operation: Freq
keyword: #pfreq=noraman
keyword: PBEPBE/SDD
title: #p freq=noraman PBEPBE/SDD
converged: YES YES NO NO
title: Mulliken charges:
elementType: N C C C C C C C C C C C C C C C C C C H H H H H H H H H H H H H H H H H
charge: -0.412634 0.095270 0.324641 0.330587 -0.418731 -0.378873 -0.458831 0.492177 -0.386388 -0.431202 0.461337 -0.321998 -0.423632 -0.451221 -0.395557 -0.253680 -0.242126 -0.318526 -0.724580 0.215392 0.221604 0.244233 0.226850 0.240573 0.223199 0.225462 0.215445 0.239681 0.219535 0.219938 0.301639 0.220421 0.219577 0.223901 0.223691 0.232824
chargesum: 0.00000
title: Mulliken charges with hydrogens summed into heavy atoms:
elementType: N C C C C C C C C C C C C C C C C C C
charge: -0.110995 0.095270 0.324641 0.330587 -0.203339 -0.157269 -0.214598 0.492177 -0.159539 -0.190629 0.461337 -0.098799 -0.198169 -0.235776 -0.155876 -0.034145 -0.022188 0.121473 -0.044163
polarizability: 5.31771121e+02 -3.23225099e+00 1.96697986e+02 -6.08113656e-01 -7.00719614e-01 8.97957207e+01
1716.lowfreq: -8.6899 -2.1915 -0.0004 0.0006 0.0008 4.6909 17.3219 29.4175 62.0979
frequency: 17.1570 29.3990 62.0810 71.3053 97.1852 120.6280 140.6957 167.3100 194.1711 226.2695 253.8642 266.4431 316.2411 354.3327 360.0766 382.6012 405.8667 415.9571 435.1603 447.6654 521.6953 541.0894 568.0149 572.6886 621.5331 637.2359 655.1729 716.2315 729.3409 748.6367 759.3642 784.7048 796.9535 803.1748 805.4181 817.5474 828.5639 840.0015 853.6798 875.1928 914.0784 919.6835 932.9127 940.6804 951.3339 958.1510 975.5647 994.2896 1016.8491 1029.9018 1071.6038 1075.4790 1113.7656 1125.3855 1146.1527 1162.2418 1166.7371 1195.2868 1198.4758 1207.1444 1260.1915 1266.7926 1282.2902 1290.2611 1320.2362 1329.5063 1356.9441 1366.7943 1392.3028 1398.7226 1416.7032 1440.8747 1445.9353 1457.0857 1472.9022 1477.4779 1484.5686 1502.1565 1506.0062 1527.8553 1564.2779 1589.7587 1611.3987 1612.7907 1640.5013 2942.9072 2981.5381 2986.0307 3072.8847 3079.2941 3096.1540 3113.6691 3115.0389 3119.1514 3123.6476 3137.7665 3157.4935 3157.9641 3172.0800 3181.3477 3215.9873 3560.9236
redmass: 3.7550 4.3664 3.1238 4.1815 2.2874 3.3981 4.0991 5.3319 3.5068 3.5651 1.2903 4.0102 3.8393 3.2671 1.2449 3.1375 3.6346 2.9900 3.1240 3.9199 2.2204 6.4331 3.2155 6.0618 6.3397 6.3130 2.5684 5.2643 2.8902 2.5543 1.3269 4.3210 1.7439 1.4352 3.1996 1.3493 1.4344 4.5622 4.7211 1.4829 1.4565 1.3695 2.0567 1.4424 1.4206 1.4064 1.3246 2.8024 2.5217 2.4186 2.6374 1.7112 1.3693 1.5658 1.4901 2.2169 1.0976 2.0802 1.1525 1.9297 1.7163 1.1097 1.8567 1.7521 1.6863 1.6798 2.7306 1.6342 2.7012 1.2400 2.3054 3.2581 2.8336 3.8256 1.6491 1.0415 1.1908 1.1227 4.3710 3.3596 4.1926 6.5891 6.6708 7.3285 6.8463 1.0577 1.1044 1.0365 1.0866 1.1008 1.0985 1.0897 1.0854 1.0885 1.0885 1.0942 1.0995 1.0947 1.0910 1.0935 1.0997 1.0771
irintensity: 0.1829 0.7562 0.3416 0.2863 3.2684 1.4694 1.0979 0.2738 0.9594 3.1915 1.1427 0.9003 4.4089 7.9111 77.9558 5.5026 1.3398 0.5249 14.9383 1.1792 32.6051 1.9577 1.0261 25.8973 8.2495 15.4349 0.2496 7.9551 10.6279 7.2741 88.0725 4.7322 23.6349 2.3936 1.1980 57.6291 30.0585 14.3495 14.4591 1.4438 17.9326 2.6261 0.5526 5.4921 1.2090 4.3958 0.0445 1.8415 23.1775 24.4939 0.6587 18.8606 19.0668 5.5690 1.9025 30.3800 11.7235 0.9087 171.9455 25.6995 13.9761 0.2488 8.4477 45.4469 17.0960 109.0792 114.1176 0.8427 0.4362 41.4161 27.5447 58.3902 12.0696 178.4069 129.2024 14.0184 3.6218 104.9722 2.2300 301.7395 5.0737 7.6041 327.3529 434.1078 130.2169 88.5940 34.6553 39.3886 14.7256 43.3821 34.5620 29.6710 4.1194 8.6928 1.5781 37.1283 73.8103 22.3561 8.5971 2.8978 13.6401 98.3665
temp: 298.150 k
press: 1.00000 atm
elementType: 7 6 6 6 6 6 6 6 6 6 6 6 6 6 6 6 6 6 6 1 1 1 1 1 1 1 1 1 1 1 1 1 1 1 1 1
symmnumber: 1
zpe: 774968.3 jmol-1
zpe.correction: 0.295170 hartree
zpe.thermalcorrener: 0.311744 hartree
zpe.thermalcorrenthalpy: 0.312688 hartree
zpe.thermalcorrgfe: 0.249384 hartree
zpe.sumelectzpe: -749.535654 hartree
zpe.sumelectthermal: -749.519080 hartree
zpe.sumelectthermalent: -749.518136 hartree
zpe.sumelectthermalfe: -749.581440 hartree
dipole: 6.5826 0.1180 -0.0643
dipole: 6.5839
quadrupole: -79.9085 -98.5866 -121.2955
quadrupole: 1.5622 -0.1176 -1.0285
quadrupole: 20.0217 1.3436 -21.3653 1.5622 -0.1176 -1.0285
hfenergy: -749.8308242 hartree
pointgroup: C01 [X(C18H17N1)]
dipole: 2.5900086 0.024308 0.0316286 debye
polarizability: 531.2702052|0.131339|145.2894882|14.2987013|-53.4329463|141.7051346 unknown
InChI: InChI=1S/C18H17N/c1-2-19-17-11-7-14(8-12-17)13-16-10-9-15-5-3-4-6-18(15)16/h3-13,19H,2H2,1H3
charge 0 multiplicity 1
36 atoms
N  5.145418 0.317158 -0.178299
C  -3.032154 -0.134423 0.090312
C  -1.627768 0.27796 -0.183232
C  -3.902358 0.745308 -0.64179
C  -0.524062 -0.346147 0.377594
C  -1.725589 1.433469 -1.095588
C  -3.057672 1.70993 -1.359156
C  0.906761 -0.142158 0.18477
C  -3.573139 -1.170526 0.875553
C  -5.302923 0.588874 -0.580594
C  3.772697 0.153703 -0.045495
C  1.497872 0.619139 -0.875623
C  1.808519 -0.766894 1.100871
C  2.884269 0.76173 -0.990169
C  3.201197 -0.625563 1.006621
C  -4.982021 -1.323591 0.93752
C  -5.838513 -0.453111 0.216839
C  6.142394 -0.267031 0.727324
C  7.564415 0.111825 0.282387
H  -0.757708 -1.134783 1.110424
H  -0.883783 2.018897 -1.464094
H  -3.433511 2.523267 -1.984812
H  -2.927761 -1.857594 1.436269
H  -5.968208 1.2574 -1.139223
H  0.861864 1.068848 -1.641592
H  1.392448 -1.371149 1.91721
H  3.304026 1.339642 -1.823804
H  3.845315 -1.118849 1.740617
H  -5.414423 -2.124163 1.548586
H  -6.924209 -0.591031 0.277533
H  5.488973 0.886402 -0.952029
H  5.967024 0.08855 1.764825
H  6.038274 -1.372635 0.743335
H  7.775042 -0.260732 -0.737091
H  7.706955 1.208234 0.291955
H  8.310436 -0.330958 0.964148
