program: Gaussian 09
title: 000259609
version: EM64L-G09RevD.01
frameworkgroup: C1[X(C21H29N3O6)]
method: RPBEPBE
basis: SDD
operation: Freq
keyword: #p
keyword: freq=noraman
keyword: PBEPBE/SDD
title: #p freq=noraman PBEPBE/SDD
converged: YES YES NO NO
title: Mulliken charges:
elementType: O O O O O O N N N C C C C C C C C C C C C C C C C C C C C C H H H H H H H H H H H H H H H H H H H H H H H H H H H H H
charge: -0.287557 -0.341058 -0.292277 -0.286429 -0.446978 -0.212695 -0.179281 -0.391944 -0.389295 -0.228074 -0.471383 -0.485486 -0.352717 0.220776 -0.242402 -0.398965 0.017686 0.315554 0.241009 -0.744842 -0.732635 -0.465230 -0.384492 0.441764 0.180603 -0.378020 -0.368539 -0.248176 -0.233749 -0.242471 0.288364 0.266053 0.222227 0.229379 0.256019 0.238567 0.246478 0.255373 0.194544 0.243365 0.388246 0.216620 0.195110 0.211200 0.262226 0.199839 0.213317 0.232111 0.362769 0.240623 0.227086 0.279172 0.281985 0.282830 0.266830 0.232868 0.227672 0.228953 0.397479
chargesum: 0.00000
title: Mulliken charges with hydrogens summed into heavy atoms:
elementType: O O O O O O N N N C C C C C C C C C C C C C C C C C C C C C
charge: -0.287557 -0.341058 -0.292277 -0.286429 -0.049499 -0.212695 -0.179281 -0.003698 -0.026526 0.060291 0.016897 -0.000087 0.132328 0.220776 0.012971 0.038944 0.234306 0.315554 0.241009 -0.076306 -0.087369 0.002479 0.176665 0.441764 0.180603 -0.095190 -0.101709 -0.015309 -0.006077 -0.013518
polarizability: 2.88507385e+02 -4.62223465e+00 2.70504385e+02 7.16305796e+00 6.89066563e+00 2.16804438e+02
1716.lowfreq: -0.8876 -0.0009 -0.0005 -0.0003 4.9752 5.4812 8.4227 19.3382 26.9654
frequency: 8.2027 18.9516 26.9355 28.2952 36.3178 40.2506 42.1514 49.1454 50.2914 58.6214 64.4241 74.2663 92.3442 96.8620 120.9125 124.4744 131.0605 147.6772 163.9392 183.0935 200.6556 212.9176 227.6103 232.7367 240.4473 247.3607 267.6335 280.8594 297.5808 308.6577 329.2522 343.3250 358.9186 378.7882 393.3910 404.1276 414.3019 436.4481 472.7340 489.4062 493.3992 508.0789 543.4089 563.2215 574.1485 598.3366 611.0684 616.1355 636.8825 652.6007 673.6946 687.4841 704.9133 705.5665 715.7556 739.4642 758.2320 776.3880 815.4530 817.5082 828.7230 837.7695 847.0095 859.9831 861.3747 862.3440 875.6871 915.7738 922.6384 926.7016 939.2447 950.6596 956.1913 966.6454 973.4705 978.6775 980.3904 984.8804 989.9124 993.6846 1001.4331 1017.7372 1027.3352 1067.9579 1078.7271 1086.0418 1094.1433 1097.4817 1100.3677 1131.9287 1143.2486 1160.7516 1172.6319 1173.4223 1179.0358 1180.0269 1194.7034 1210.7332 1211.8547 1222.6895 1226.7601 1235.2431 1238.9227 1244.3240 1271.7270 1273.1911 1301.0912 1306.7671 1307.8039 1310.8004 1319.4803 1324.8156 1329.3393 1335.4170 1337.2440 1340.3366 1345.0811 1352.9278 1367.4104 1380.8710 1384.6621 1397.7690 1441.9607 1452.9155 1457.8815 1458.6298 1459.7430 1471.1952 1473.8412 1474.8326 1481.4510 1482.7198 1486.1638 1493.6170 1499.5215 1511.7065 1593.0294 1599.1598 1612.5100 1613.9667 1647.2216 1685.5023 2962.1407 2963.1567 2966.4294 2978.1685 2992.6890 2996.9423 3014.8987 3026.8162 3027.9822 3030.9203 3031.6695 3041.8015 3045.3930 3055.0670 3061.8666 3063.3717 3069.2996 3072.9167 3095.3812 3110.4193 3113.6504 3122.5031 3131.7205 3142.3152 3152.8967 3164.6224 3401.2459 3533.7432 3546.9178
redmass: 6.7697 4.5458 4.4733 5.5861 4.1989 8.1515 4.5158 4.3329 3.3015 3.9133 7.4205 4.7596 6.0968 4.9692 4.0138 3.8590 3.3503 4.3456 4.3437 3.1419 2.1377 1.3531 4.1820 3.6869 2.4592 1.8254 5.2153 3.3899 5.1938 4.0439 3.6542 4.4195 2.4550 3.2055 2.6835 2.8235 2.3627 3.3912 4.1649 4.4171 1.9708 5.0181 4.0206 3.4597 2.8797 4.0523 1.1266 6.2614 3.8480 1.4458 5.2530 8.3411 3.0068 2.6491 5.0624 3.9916 1.9704 1.2970 3.8296 3.5778 2.8831 4.0232 1.9215 2.1383 2.3006 1.2582 4.0772 2.0847 1.2887 2.3641 1.5025 2.3467 1.4203 1.8383 2.8346 2.0589 2.5109 1.4952 3.9628 2.3445 1.4123 3.1452 2.2589 2.2060 2.1163 2.0107 1.5532 2.4086 2.6749 2.4188 3.2147 2.2816 1.0549 1.3621 1.7738 1.9076 1.1646 1.0894 1.6196 2.5541 1.5635 1.2259 1.1821 1.5945 1.6014 1.3401 2.0216 1.5097 1.4734 1.3473 1.3900 1.5295 1.4547 1.3969 1.2579 1.4928 1.4096 1.6621 2.4379 1.2119 7.6029 1.2118 2.1500 1.0975 1.0883 1.0843 1.1362 1.0693 1.0503 1.0964 1.2499 1.6410 2.2311 1.0852 1.0535 1.8168 5.9684 7.2507 5.8635 5.7763 10.6845 9.3194 1.0616 1.0366 1.0425 1.0762 1.0605 1.0621 1.0694 1.0904 1.0623 1.0990 1.0816 1.0580 1.0932 1.0986 1.1011 1.0984 1.0998 1.0996 1.1028 1.1022 1.1084 1.0848 1.0885 1.0932 1.0964 1.1012 1.0804 1.0645 1.0785
irintensity: 0.2407 0.4271 1.3527 1.5487 0.0910 4.3968 0.8826 1.0504 0.5179 0.2368 5.7937 0.6450 3.9140 3.2188 1.0152 7.5793 1.8780 0.7475 0.2640 1.8931 6.3197 0.3924 6.6105 4.4909 4.7264 1.1856 2.0884 10.4478 10.2926 0.4510 12.4929 2.4846 12.9296 10.7268 3.9853 0.5323 2.0272 7.3153 0.6157 9.5214 38.7361 17.3424 52.9178 2.7691 3.9375 17.0486 21.9392 0.3279 6.6191 199.2896 9.9326 22.7295 34.1662 44.3150 3.1176 2.9302 81.3467 128.7221 15.6414 9.1360 13.7181 11.1355 10.4691 25.3145 17.1720 1.0011 53.9439 25.6223 4.8002 17.4592 6.6969 5.6785 0.4277 0.7110 1.0320 3.6546 68.0474 1.0062 3.0686 61.7318 1.4784 70.7606 2.5443 18.2079 212.7620 8.7983 9.0551 5.7729 6.9236 1.9218 13.0563 22.3834 0.3810 11.2510 8.5022 4.8264 0.1125 0.6596 10.0260 22.7059 12.1762 2.2889 20.0493 12.0547 77.1289 28.6768 28.6969 35.9035 33.6512 6.8754 6.0126 37.4210 26.5739 10.2736 4.7484 5.0520 4.2795 8.4477 176.2396 13.8793 2.8455 20.7071 11.5563 30.6563 15.7460 10.3772 37.9788 12.0603 3.3470 26.2444 135.9208 347.5235 8.7640 3.4434 8.4672 164.5002 1.2371 364.2133 20.8484 15.8048 374.4346 283.4815 10.6834 25.8811 33.2525 40.0182 26.6952 31.8616 20.0453 2.8843 27.6303 3.5545 21.6084 36.8881 16.7039 4.2241 18.3748 83.8100 24.8971 39.2823 33.2603 14.1844 5.1005 0.4133 10.0253 11.9719 16.2358 19.9218 206.4778 34.0250 78.9072
temp: 298.150 k
press: 1.00000 atm
elementType: 8 8 8 8 8 8 7 7 7 6 6 6 6 6 6 6 6 6 6 6 6 6 6 6 6 6 6 6 6 6 1 1 1 1 1 1 1 1 1 1 1 1 1 1 1 1 1 1 1 1 1 1 1 1 1 1 1 1 1
symmnumber: 1
zpe: 1265276.0 jmol-1
zpe.correction: 0.481918 hartree
zpe.thermalcorrener: 0.512897 hartree
zpe.thermalcorrenthalpy: 0.513841 hartree
zpe.thermalcorrgfe: 0.414488 hartree
zpe.sumelectzpe: -1431.021457 hartree
zpe.sumelectthermal: -1430.990478 hartree
zpe.sumelectthermalent: -1430.989534 hartree
zpe.sumelectthermalfe: -1431.088887 hartree
dipole: -1.9643 -1.2183 1.1964
dipole: 2.6027
quadrupole: -175.5987 -174.8336 -175.2140
quadrupole: 1.3498 -10.8927 9.5546
quadrupole: -0.3833 0.3818 0.0015 1.3498 -10.8927 9.5546
hfenergy: -1431.5033749 hartree
pointgroup: C01 [X(C21H29N3O6)]
dipole: 0.9303598 -0.1444831 0.4026376 debye
polarizability: 278.8815802|-4.4158817|270.9244936|-15.6113885|20.8755908|226.0101344 unknown
InChI: InChI=1S/C21H29N3O6/c1-14(2)11-16(19(27)22-12-18(25)26)23-20(28)17-9-6-10-24(17)21(29)30-13-15-7-4-3-5-8-15/h3-5,7-8,14,16-17,22-23,25H,6,9-13H2,1-2H3
charge 0 multiplicity 1
59 atoms
O  1.890938 1.823622 0.92744
O  -1.873501 1.173784 -1.642484
O  -3.638042 1.887397 -0.236911
O  1.113505 -1.563603 -2.503765
O  5.796399 -2.318972 -1.470868
O  5.928421 -3.261566 -3.59503
N  -1.429541 2.570164 0.13282
N  0.652631 0.410653 -0.456043
N  3.237987 -1.751145 -1.598853
C  -0.026462 2.77652 -0.337816
C  0.357371 4.123616 0.310144
C  -0.43297 4.122559 1.644718
C  -1.779104 3.450122 1.28501
C  0.929519 1.629745 0.115117
C  1.451675 -0.791564 -0.183617
C  0.650584 -1.870729 0.604207
C  0.142304 -1.408465 1.994599
C  -2.413627 1.888543 -0.535611
C  1.912253 -1.386977 -1.528385
C  1.302608 -1.074356 2.963139
C  -0.783179 -2.495827 2.591194
C  -2.878041 0.39711 -2.455869
C  3.77666 -2.375044 -2.808136
C  -3.111905 -0.992454 -1.90281
C  5.253252 -2.710104 -2.705285
C  -2.220672 -2.049572 -2.224045
C  -4.2275 -1.252693 -1.065578
C  -2.447634 -3.349329 -1.718235
C  -4.454011 -2.553327 -0.562579
C  -3.566312 -3.605512 -0.890518
H  -0.019816 2.810983 -1.44243
H  1.444005 4.188718 0.472677
H  0.030613 4.955603 -0.339923
H  -0.580598 5.135527 2.053903
H  0.114069 3.520883 2.39065
H  -2.545996 4.182567 0.968874
H  -2.204296 2.854471 2.110953
H  2.32093 -0.457652 0.411467
H  1.301224 -2.761379 0.733775
H  -0.209097 -2.18542 -0.018788
H  -0.149344 0.337071 -1.099811
H  -0.460745 -0.489015 1.84509
H  1.971973 -1.948741 3.088088
H  0.909349 -0.810163 3.962471
H  1.901278 -0.216874 2.607129
H  -0.224924 -3.437212 2.762407
H  -1.198554 -2.170504 3.562977
H  -1.629769 -2.718659 1.915044
H  3.885552 -1.562339 -0.83047
H  -3.808935 0.987552 -2.481345
H  -2.406311 0.371492 -3.450968
H  3.227686 -3.30566 -3.050355
H  3.634675 -1.717422 -3.688458
H  -1.336245 -1.854725 -2.842356
H  -4.897469 -0.428073 -0.798783
H  -1.754742 -4.159028 -1.973293
H  -5.319131 -2.74605 0.081802
H  -3.744986 -4.615816 -0.504576
H  6.764597 -2.543131 -1.436199
