program: Gaussian 09
title: 000259348
version: EM64L-G09RevD.01
frameworkgroup: C1[X(C16H18N2)]
method: RPBEPBE
basis: SDD
operation: Freq
keyword: #pfreq=noraman
keyword: PBEPBE/SDD
title: #p freq=noraman PBEPBE/SDD
converged: YES YES NO NO
title: Mulliken charges:
elementType: N N C C C C C C C C C C C C C C C C H H H H H H H H H H H H H H H H H H
charge: -0.490080 -0.027742 0.129991 0.185730 -0.492919 -0.510974 -0.003036 -0.422940 -0.401339 0.060807 0.381009 0.183038 0.443043 -0.733724 -0.848197 -0.824027 -0.647453 -0.126529 0.212306 0.219277 0.225500 0.217803 0.206289 0.207174 0.207465 0.212076 0.303198 0.226094 0.229366 0.230767 0.228275 0.235595 0.206204 0.259961 0.255240 0.262753
chargesum: 0.00000
title: Mulliken charges with hydrogens summed into heavy atoms:
elementType: N N C C C C C C C C C C C C C C C C
charge: -0.186882 -0.027742 0.129991 0.185730 -0.061336 -0.067672 -0.003036 -0.009478 0.018201 0.060807 0.381009 0.183038 0.443043 -0.507630 -0.159788 -0.122267 -0.129459 -0.126529
polarizability: 2.54140344e+02 -3.29403252e+00 1.89406916e+02 9.91964193e-01 -3.04672524e+00 1.13356644e+02
1716.lowfreq: -1.3777 -0.0008 -0.0005 -0.0004 4.8870 7.9235 37.7440 45.9235 66.6326
frequency: 37.6349 45.8674 66.6189 87.4190 102.1735 118.3214 150.7139 160.1448 168.2370 223.4713 253.3609 262.9920 291.7678 304.5457 319.5605 323.0642 358.9036 367.6815 378.0849 447.9897 457.0879 465.5105 497.5896 548.2611 574.1749 577.7618 598.6421 619.3418 644.4364 697.4558 706.5874 773.0207 780.2231 825.5586 847.9670 861.3551 886.8711 908.0081 915.5619 922.6286 949.7202 970.3842 995.7361 1032.9816 1039.5286 1041.2775 1078.0002 1085.8120 1092.7547 1127.1139 1132.0459 1153.1777 1165.2636 1183.6591 1227.3737 1238.1012 1245.5399 1259.7533 1288.7305 1296.6739 1319.0428 1338.0754 1339.4801 1348.3791 1359.8232 1374.0042 1396.9095 1401.8728 1417.9756 1442.4093 1452.6626 1457.8367 1463.3222 1466.8024 1469.1148 1471.2366 1474.3155 1482.9314 1486.0356 1522.5610 1587.2708 1589.2840 1628.9437 2192.1060 2950.4629 2950.9590 2969.2691 2973.7333 2977.3755 2979.8152 2981.8257 3002.6992 3021.9416 3040.6278 3043.0267 3045.5632 3050.5821 3051.8937 3079.7702 3080.4046 3112.3885 3609.3439
redmass: 3.5529 5.2023 1.2923 3.4861 2.9265 2.9429 1.1479 2.5797 3.2649 3.4146 2.7349 2.8201 3.0287 2.2222 3.7638 2.8946 2.8962 4.4095 4.3479 3.9753 3.4716 4.2912 1.2337 3.3678 3.1817 3.6972 3.8144 4.0785 4.1703 3.1499 5.0783 4.4796 4.2071 1.5202 2.3397 1.6355 2.3938 1.4867 1.9931 3.4180 2.4554 2.1889 2.4815 1.5172 1.8238 1.5411 1.8593 2.9695 2.0330 2.5413 1.1791 1.4724 3.0471 1.2335 1.6627 1.3021 1.5112 1.3867 1.5238 1.5013 2.0155 1.4875 1.4767 3.0265 2.4312 3.4785 1.3069 1.2257 4.0558 1.1692 1.7490 1.2185 1.1054 1.1379 1.0683 1.2166 1.1079 1.1124 1.2168 3.9058 8.2904 6.9348 6.2673 12.4177 1.0610 1.0667 1.0386 1.0390 1.0615 1.0629 1.0676 1.0920 1.0919 1.0992 1.0979 1.0954 1.1029 1.0979 1.0957 1.0988 1.0906 1.0800
irintensity: 3.8239 2.3369 0.6801 1.0650 1.2439 1.7677 0.9497 3.9455 1.0164 0.7189 1.4179 3.4636 0.5294 1.7624 0.3337 0.0728 0.1439 0.9952 0.6365 0.0998 2.1680 0.5895 78.5688 12.9671 1.9087 0.7621 1.9539 0.2559 0.0980 0.4027 4.7610 0.8830 0.5840 5.6759 6.6190 15.8584 1.1885 0.6100 1.9829 1.3955 3.0121 5.8596 0.6034 6.7062 2.6307 7.4732 0.1852 1.7360 2.0143 1.4159 4.0235 1.6995 21.3861 1.2051 5.5607 6.2466 1.1208 3.3477 2.1662 6.6428 2.1107 1.8318 4.6887 49.4420 0.0356 24.0689 20.5585 5.6292 16.0879 25.0072 9.5625 1.0022 13.0614 5.0202 10.2176 18.4047 3.5551 19.8578 34.4729 10.6333 5.8226 10.3158 5.5562 16.4432 62.6487 22.8977 42.8336 42.3347 29.2818 16.9848 23.3580 51.1508 30.6425 79.7139 22.9431 2.8112 31.7029 55.8966 21.9889 24.8542 23.8660 40.1136
temp: 298.150 k
press: 1.00000 atm
elementType: 7 7 6 6 6 6 6 6 6 6 6 6 6 6 6 6 6 6 1 1 1 1 1 1 1 1 1 1 1 1 1 1 1 1 1 1
symmnumber: 1
zpe: 787048.9 jmol-1
zpe.correction: 0.299771 hartree
zpe.thermalcorrener: 0.316729 hartree
zpe.thermalcorrenthalpy: 0.317674 hartree
zpe.thermalcorrgfe: 0.255149 hartree
zpe.sumelectzpe: -728.724416 hartree
zpe.sumelectthermal: -728.707458 hartree
zpe.sumelectthermalent: -728.706514 hartree
zpe.sumelectthermalfe: -728.769038 hartree
dipole: 4.2821 -0.6381 -2.7217
dipole: 5.1138
quadrupole: -117.6106 -93.9913 -113.5091
quadrupole: -8.0696 16.4120 2.6907
quadrupole: -9.2403 14.3791 -5.1388 -8.0696 16.4120 2.6907
hfenergy: -729.0241872 hartree
pointgroup: C01 [X(C16H18N2)]
dipole: -1.7324914 0.2318459 -0.9962818 debye
polarizability: 254.052129|0.8751801|188.3806464|-6.0392533|8.5553735|114.471128 unknown
InChI: InChI=1S/C16H18N2/c1-10-9-12(7-8-17)11(2)16-15(10)13-5-3-4-6-14(13)18-16/h9,18H,3-7H2,1-2H3
charge 0 multiplicity 1
36 atoms
N  -0.924552 1.654297 -0.010605
N  5.097989 0.941366 1.370515
C  -1.928204 -0.396711 0.041561
C  -2.148984 0.979162 0.125701
C  -3.066935 -1.391827 0.14266
C  -3.472369 1.664768 0.331146
C  -0.499151 -0.589228 -0.16067
C  -4.339755 -0.712973 0.717669
C  -4.618321 0.655864 0.04848
C  0.103573 0.720208 -0.190081
C  0.34158 -1.731855 -0.318145
C  1.487164 0.961139 -0.375561
C  2.296406 -0.192057 -0.528188
C  1.720573 -1.498167 -0.496677
C  -0.2025 -3.148831 -0.285843
C  2.030471 2.379434 -0.378444
C  3.810059 -0.073954 -0.739455
C  4.53022 0.482803 0.426081
H  -3.298404 -1.814889 -0.857799
H  -2.787011 -2.250652 0.781368
H  -3.557875 2.041134 1.372522
H  -3.572304 2.548197 -0.331729
H  -5.210754 -1.382532 0.5842
H  -4.212079 -0.560047 1.808415
H  -5.576624 1.071916 0.412259
H  -4.71697 0.511768 -1.045626
H  -0.805203 2.663788 0.030388
H  2.38584 -2.363194 -0.614476
H  -1.030083 -3.285749 -1.0060
H  0.58525 -3.881852 -0.531145
H  -0.598176 -3.407563 0.715072
H  2.977073 2.4641 -0.938142
H  1.317674 3.086494 -0.844255
H  2.237963 2.736357 0.649202
H  4.046026 0.563297 -1.615323
H  4.234296 -1.071016 -0.957069
