program: Gaussian 09
title: 000259492
version: EM64L-G09RevD.01
frameworkgroup: C1[X(C18H20N4O8S2)]
method: RPBEPBE
basis: SDD
operation: Freq
keyword: #p
keyword: freq=noraman
keyword: PBEPBE/SDD
title: #p freq=noraman PBEPBE/SDD
converged: YES YES NO NO
title: Mulliken charges:
elementType: S S O O O O O O O O N N N N C C C C C C C C C C C C C C C C C C H H H H H H H H H H H H H H H H H H H H
charge: 0.930913 0.931004 -0.514682 -0.506821 -0.523712 -0.498332 -0.192123 -0.193395 -0.189803 -0.185220 -0.370599 -0.370494 0.024702 0.024619 -0.039233 -0.043530 -0.439078 -0.444702 -0.674449 -0.674506 0.032254 0.043312 -0.348958 -0.395497 -0.281334 -0.232645 0.398691 0.396827 -0.171752 -0.172271 -0.352695 -0.352583 0.232286 0.231921 0.298161 0.257790 0.298463 0.256282 0.255015 0.237658 0.225069 0.242500 0.226430 0.252568 0.329707 0.337483 0.307239 0.290206 0.257273 0.255754 0.297061 0.297228
chargesum: 0.00000
title: Mulliken charges with hydrogens summed into heavy atoms:
elementType: S S O O O O O O O O N N N N C C C C C C C C C C C C C C C C C C
charge: 0.930913 0.931004 -0.514682 -0.506821 -0.523712 -0.498332 -0.192123 -0.193395 -0.189803 -0.185220 -0.370599 -0.370494 0.024702 0.024619 0.193053 0.188391 0.116873 0.110042 0.043292 0.046992 0.032254 0.043312 -0.019251 -0.058014 0.025905 0.057561 0.398691 0.396827 0.085521 0.083483 -0.055634 -0.055354
polarizability: 4.25935933e+02 2.07834758e+01 2.81095066e+02 4.60437022e+01 -2.12497299e+01 2.40191577e+02
1716.lowfreq: -10.2678 -2.1326 0.0017 0.0020 0.0020 3.8608 8.1270 12.3258 14.6260
frequency: 3.7762 12.0343 14.1488 18.9597 25.7471 36.4880 43.1281 55.2929 58.2094 83.3290 104.8386 107.6646 119.9477 136.0227 142.6833 160.1731 167.1681 179.3066 189.0280 190.5567 193.6849 199.0613 203.0392 212.1833 226.4661 230.2443 239.5794 254.7363 274.9146 286.1807 303.8678 330.0383 344.4595 374.8386 380.1034 393.5720 399.7127 404.2958 417.2080 419.5000 424.2354 427.5922 436.0102 471.6521 480.1041 510.5501 515.0131 516.7338 520.6870 578.7317 597.1426 637.0920 638.0769 669.3867 670.7338 685.9559 687.7555 701.5055 702.8653 754.9283 755.5155 779.2101 791.2382 793.3378 809.2505 811.2990 816.3037 825.6451 840.9484 875.6452 919.5456 921.6150 927.6175 941.2637 944.1174 956.6751 960.8840 968.4200 974.9786 981.1309 981.3882 1006.0548 1012.6681 1026.1981 1052.0171 1052.5812 1058.0434 1078.8099 1079.7236 1085.1393 1096.1670 1097.3985 1099.7867 1109.7258 1142.1200 1160.2609 1168.0690 1170.8645 1212.3581 1213.3693 1261.6956 1266.2165 1266.5489 1270.7905 1288.3454 1294.9886 1324.3484 1331.8315 1344.3130 1353.3561 1376.0746 1376.7075 1400.2463 1402.1470 1403.7445 1410.2194 1424.0697 1425.4267 1446.1870 1447.4749 1456.6554 1464.0294 1466.1899 1480.1805 1482.1297 1488.6852 1584.3278 1585.4938 1600.3600 1601.6432 2966.9319 2969.3615 2988.4558 2996.2429 2998.2882 3001.0808 3045.1270 3049.7647 3091.1562 3094.2789 3112.2910 3117.8175 3153.4718 3158.0635 3168.5203 3169.5748 3173.1699 3180.7998 3188.7732 3188.9193
redmass: 7.5827 9.4175 7.0493 6.5961 7.0377 5.4727 7.0818 10.2874 10.4557 5.2580 11.2558 8.6442 3.1329 2.4345 5.3491 5.3808 5.7290 6.4761 4.6842 2.5662 3.4532 6.2093 3.2018 8.2823 1.5148 8.6919 9.7074 3.3479 5.1177 5.4308 4.6596 6.3300 6.3432 9.1967 8.2446 8.2392 8.2280 2.4547 2.4815 3.4056 3.5034 3.5278 3.6328 5.3740 6.1548 6.0904 6.9296 6.7720 6.7737 4.5552 3.8764 7.3278 7.3731 3.2408 3.4812 9.6781 9.6422 3.8626 3.8886 4.4986 2.5758 3.0023 9.7020 10.1111 10.0881 9.8563 1.4746 1.4015 3.1923 2.4134 7.0927 9.3365 1.4848 1.3844 1.9171 1.4396 1.9875 1.3768 1.9476 5.7281 5.3612 1.3685 1.3575 1.9596 1.8939 1.8880 1.8524 1.8319 1.9477 1.8672 2.4228 2.7818 2.5748 1.8209 3.1539 4.0968 1.1201 1.1295 9.6536 10.1469 1.2231 1.3325 1.3173 1.1677 1.5616 1.5543 1.1755 1.1713 1.2620 1.2959 8.4065 8.4693 1.2142 7.8229 8.1896 1.1910 3.0866 3.0243 2.3915 2.3756 1.0551 1.0582 1.0459 1.0501 1.0662 1.0500 6.9770 6.8876 7.6837 7.7183 1.0830 1.0815 1.0630 1.0590 1.0406 1.0404 1.1014 1.1028 1.0988 1.0978 1.0999 1.0992 1.0893 1.0883 1.0925 1.0933 1.0942 1.0928 1.0978 1.0974
irintensity: 0.3664 2.0381 1.0480 1.8526 1.3149 0.3138 0.8165 1.8688 0.2438 2.8954 4.3757 2.0313 1.4877 0.6424 0.3451 2.1531 0.5301 0.9338 0.9383 6.2524 6.4373 3.1603 11.0356 5.1877 3.8637 7.4408 11.7024 2.4115 2.0281 35.4865 0.6841 0.9223 3.1978 21.9562 13.6913 4.1980 3.5113 5.4488 0.7799 2.2421 3.6702 0.8007 22.4148 96.1493 175.0653 3.5199 5.7227 3.3866 163.5508 0.1239 0.8002 19.3512 2.4699 15.2553 8.5549 22.2886 9.0285 28.9141 28.4680 0.2009 22.9634 61.3210 57.1672 76.0943 50.1427 70.5383 18.0040 25.2296 9.3677 0.2096 61.3902 50.5845 12.3628 1.1953 15.2344 16.5431 38.3869 2.5076 4.5679 4.2007 0.3854 1.0738 1.4058 102.0463 44.1222 22.0921 13.7697 42.3741 18.9885 0.3787 41.1597 24.0898 17.2752 5.9542 46.0938 3.8118 23.6284 21.4490 319.4857 177.1826 0.8641 1.1959 0.0538 47.7126 21.9593 1.1669 1.8958 20.2468 2.7171 24.7702 75.3696 74.8288 4.7251 3.5968 4.3776 44.5704 65.1718 51.2117 22.9352 23.7286 9.4496 36.4314 2.4730 15.4998 12.5224 5.7402 2.4840 1.7231 3.5540 3.2143 30.0207 12.7623 29.3591 43.3440 14.5799 5.9696 20.2016 8.9095 18.6042 4.4151 19.8170 6.8445 5.2537 3.3649 12.8521 8.9813 7.7118 10.2802 2.2331 2.5281
temp: 298.150 k
press: 1.00000 atm
elementType: 16 16 8 8 8 8 8 8 8 8 7 7 7 7 6 6 6 6 6 6 6 6 6 6 6 6 6 6 6 6 6 6 1 1 1 1 1 1 1 1 1 1 1 1 1 1 1 1 1 1 1 1
symmnumber: 1
zpe: 976133.9 jmol-1
zpe.correction: 0.371790 hartree
zpe.thermalcorrener: 0.403797 hartree
zpe.thermalcorrenthalpy: 0.404741 hartree
zpe.thermalcorrgfe: 0.302453 hartree
zpe.sumelectzpe: -2311.922851 hartree
zpe.sumelectthermal: -2311.890844 hartree
zpe.sumelectthermalent: -2311.889900 hartree
zpe.sumelectthermalfe: -2311.992188 hartree
dipole: 1.8253 4.5726 0.9245
dipole: 5.0096
quadrupole: -221.2505 -217.4916 -217.6334
quadrupole: -41.1943 33.2009 -7.0690
quadrupole: -2.4586 1.3002 1.1584 -41.1943 33.2009 -7.0690
hfenergy: -2312.2946404 hartree
pointgroup: C01 [X(C18H20N4O8S2)]
dipole: -0.4447414 0.8225719 -1.7349545 debye
polarizability: 415.1064858|17.4239621|272.1290341|63.7221794|-26.8868504|259.9870557 unknown
InChI: InChI=1S/C18H20N4O8S2/c1-13-11-20(32(29,30)18-8-4-6-16(10-18)22(25)26)14(2)12-19(13)31(27,28)17-7-3-5-15(9-17)21(23)24/h3-10,13-14H,11-12H2,1-2H3
charge 0 multiplicity 1
52 atoms
S  -2.711862 -0.714627 1.279799
S  2.650967 -1.518051 -1.081735
O  -2.782375 0.432549 2.434841
O  -2.582575 -2.281051 1.733948
O  2.640463 -1.563065 -2.712656
O  2.659635 -2.91714 -0.239845
O  -7.352903 1.990706 -2.330611
O  7.795498 0.080314 2.504806
O  -5.522415 3.009121 -1.424755
O  6.291559 -1.591954 2.894468
N  -1.449118 -0.056096 0.082563
N  1.316968 -0.285473 -0.666568
N  -6.259459 1.975577 -1.648056
N  6.740919 -0.599339 2.207036
C  -1.114203 -0.853671 -1.151616
C  0.997185 0.003448 0.777118
C  -0.376443 0.72825 0.739286
C  0.221575 -0.249624 -1.663105
C  -1.016249 -2.393664 -1.024931
C  0.968775 -1.178101 1.777883
C  -4.25197 -0.614153 0.18244
C  4.166876 -0.532147 -0.524152
C  -4.633009 0.639006 -0.31274
C  4.84115 -0.949786 0.628142
C  -4.979238 -1.796679 -0.028963
C  4.578823 0.543149 -1.330409
C  -5.81456 0.670541 -1.082335
C  5.987208 -0.205389 0.982951
C  -6.163255 -1.719989 -0.801055
C  5.734619 1.259059 -0.942747
C  -6.587796 -0.485152 -1.334086
C  6.444539 0.890744 0.221033
H  -1.895718 -0.620878 -1.904257
H  1.752013 0.735928 1.131141
H  -0.701558 0.968321 1.768946
H  -0.280347 1.690012 0.201014
H  0.555111 -0.790682 -2.56824
H  0.063896 0.805086 -1.957964
H  -0.162171 -2.716596 -0.406832
H  -1.927628 -2.837461 -0.593934
H  -0.876385 -2.810086 -2.039442
H  1.896331 -1.771152 1.757306
H  0.850327 -0.76019 2.794366
H  0.127301 -1.867228 1.597283
H  -4.058604 1.550009 -0.123868
H  4.519953 -1.81764 1.212705
H  -4.629199 -2.736776 0.410914
H  4.021691 0.797484 -2.237433
H  -6.75264 -2.623613 -0.9821
H  6.082685 2.100067 -1.549628
H  -7.497903 -0.397953 -1.933345
H  7.341517 1.426232 0.543208
