program: Gaussian 09
title: 000259371
version: EM64L-G09RevD.01
frameworkgroup: C1[X(C16H15NO2S)]
method: RPBEPBE
basis: SDD
operation: Freq
keyword: #p
keyword: freq=noraman
keyword: PBEPBE/SDD
title: #p freq=noraman PBEPBE/SDD
converged: YES YES NO NO
title: Mulliken charges:
elementType: S O O N C C C C C C C C C C C C C C C C H H H H H H H H H H H H H H H
charge: 0.917342 -0.511546 -0.510282 -0.421920 0.197863 0.203296 0.194930 0.153690 -0.309060 -0.001902 -0.805655 -0.404680 -0.801222 -0.235468 -0.237645 -0.268295 -0.229171 -0.215325 -0.205563 -0.216473 0.281049 0.245006 0.230762 0.263477 0.238836 0.224707 0.235545 0.239912 0.226907 0.224211 0.294457 0.275222 0.244050 0.243318 0.239630
chargesum: 0.00000
title: Mulliken charges with hydrogens summed into heavy atoms:
elementType: S O O N C C C C C C C C C C C C C C C C
charge: 0.917342 -0.511546 -0.510282 -0.421920 0.197863 0.203296 0.194930 0.153690 -0.028011 -0.001902 -0.066411 -0.165845 -0.101059 -0.008561 -0.013434 0.026163 0.046051 0.028724 0.037755 0.023158
polarizability: 3.38365439e+02 1.63901220e+01 2.11314298e+02 1.09917822e+01 1.12064972e+01 1.44224728e+02
1716.lowfreq: -12.3413 -0.0013 -0.0009 0.0003 1.6421 5.9524 16.9392 25.7167 39.8548
frequency: 16.4781 25.6880 39.8502 73.6802 102.5950 114.5209 131.3825 138.2984 154.0707 156.7036 186.3874 187.5760 196.0445 234.3244 248.4417 289.2258 311.4481 325.7712 355.0712 379.5617 400.9788 426.7509 429.2715 479.2530 497.8478 522.6807 560.9678 575.5601 601.9498 626.4832 649.5393 657.4436 688.1448 714.7234 751.5717 757.4930 760.6123 802.6310 845.8080 846.9894 862.9414 868.8694 928.8601 933.7706 937.8132 954.7525 976.4154 977.2823 984.2206 1006.2674 1008.0003 1015.7214 1030.1619 1046.4953 1050.5705 1060.0595 1077.4727 1103.4983 1132.9996 1165.2336 1173.7823 1178.8384 1195.0093 1218.3588 1288.9547 1303.8305 1357.6491 1383.0548 1396.7841 1403.9229 1413.5136 1436.3655 1441.9877 1452.6468 1460.7118 1462.9582 1464.9190 1471.3402 1478.4277 1576.3120 1587.8094 1594.1622 1603.6654 1605.7346 2969.1476 2977.8552 3039.0411 3056.2255 3087.9484 3096.8318 3127.3784 3138.5586 3141.6424 3149.1852 3158.1421 3159.9706 3167.6673 3176.7602 3187.3054
redmass: 4.5515 4.7070 4.5129 4.7670 1.1424 3.6860 5.8963 5.3344 4.1670 4.1568 1.1889 4.1993 6.7957 3.1135 8.5426 2.7067 4.3890 6.0241 4.8627 10.2208 2.8297 4.0436 5.8020 5.4165 4.2437 4.3294 4.3898 3.8931 6.4821 4.0704 6.0195 6.7075 2.3405 5.0795 2.5467 1.6072 1.4478 13.5685 3.8229 1.2564 1.5721 3.2029 8.4666 1.3799 1.4416 2.0520 1.3291 6.0442 1.3903 1.3343 4.1461 2.2003 1.4668 2.1193 1.5122 2.3275 1.5552 1.7823 2.9909 1.2778 1.0618 1.1180 2.0817 3.4238 1.5582 1.3008 2.8543 8.3435 1.5861 1.4010 2.4826 2.2439 2.9176 2.0059 2.6550 1.0616 1.0574 1.1570 1.0880 5.8200 6.5402 6.1830 6.9135 6.9810 1.0384 1.0386 1.0971 1.0971 1.0968 1.0965 1.0859 1.0859 1.0913 1.0886 1.0928 1.0974 1.0969 1.1012 1.0960
irintensity: 0.5891 0.9165 1.1998 2.4628 0.6107 2.2156 12.8790 1.6183 8.7587 2.6361 0.2247 5.6208 12.2830 0.7645 8.0631 2.6447 9.0302 1.0932 29.7741 12.4467 0.1184 70.0101 109.7661 9.5415 82.3404 1.5036 1.4685 27.4032 0.0468 38.0139 0.4986 11.4158 32.4167 4.4620 26.2491 54.2507 73.0405 82.8583 9.2179 0.5850 2.2169 2.6259 60.8136 1.1000 1.6704 5.2535 0.7248 6.2480 0.5932 0.0773 2.0324 14.5091 7.6879 25.0993 3.2831 1.0830 6.4480 13.7200 2.5322 13.6926 1.1518 11.7122 10.4787 15.6870 0.2014 4.0206 2.6397 5.1916 9.0193 8.2661 16.6847 13.3074 76.8139 17.9655 10.8188 3.1742 20.3713 16.7205 20.0516 7.8934 10.4007 15.8550 0.4642 11.1508 35.5193 24.5982 17.8502 9.1335 15.5131 21.4468 1.6494 1.0862 16.7121 8.7305 1.7388 39.5877 9.8860 25.0738 6.0067
temp: 298.150 k
press: 1.00000 atm
elementType: 16 8 8 7 6 6 6 6 6 6 6 6 6 6 6 6 6 6 6 6 1 1 1 1 1 1 1 1 1 1 1 1 1 1 1
symmnumber: 1
zpe: 699633.7 jmol-1
zpe.correction: 0.266476 hartree
zpe.thermalcorrener: 0.285563 hartree
zpe.thermalcorrenthalpy: 0.286507 hartree
zpe.thermalcorrgfe: 0.217635 hartree
zpe.sumelectzpe: -1220.377888 hartree
zpe.sumelectthermal: -1220.358801 hartree
zpe.sumelectthermalent: -1220.357857 hartree
zpe.sumelectthermalfe: -1220.426729 hartree
dipole: 2.1421 2.7724 -4.3074
dipole: 5.5523
quadrupole: -97.0386 -118.0297 -134.2785
quadrupole: 1.5373 -5.9406 6.0097
quadrupole: 19.4103 -1.5807 -17.8296 1.5373 -5.9406 6.0097
hfenergy: -1220.644364 hartree
pointgroup: C01 [X(C16H15N1O2S1)]
dipole: -0.7732346 0.4463967 1.9936433 debye
polarizability: 334.6687112|-28.8807317|213.5844155|1.7633086|15.2575239|145.6513386 unknown
InChI: InChI=1S/C16H15NO2S/c1-12-13(2)17(16-11-7-6-10-15(12)16)20(18,19)14-8-4-3-5-9-14/h3-11H,1-2H3
charge 0 multiplicity 1
35 atoms
S  -0.904343 -0.025112 -1.326659
O  -0.77291 -1.47055 -2.062187
O  -0.959861 1.350559 -2.204139
N  0.508716 0.020057 0.115831
C  1.70188 -0.729682 -0.143552
C  0.898888 1.319139 0.575975
C  2.811877 0.060882 0.303073
C  2.282921 1.350556 0.753671
C  1.865719 -2.036498 -0.638602
C  -2.453163 -0.061484 -0.242398
C  -0.130326 2.370504 0.87564
C  4.112669 -0.487379 0.288219
C  3.110475 2.448794 1.360592
C  3.1835 -2.555773 -0.680185
C  4.290266 -1.797388 -0.218458
C  -3.324467 1.035211 -0.32336
C  -2.689893 -1.199562 0.544898
C  -4.511258 0.984829 0.444672
C  -3.878902 -1.227057 1.309898
C  -4.783719 -0.139459 1.258705
H  1.015984 -2.619155 -1.00031
H  -0.941284 1.972911 1.512804
H  0.331113 3.220101 1.404385
H  -0.588176 2.76145 -0.053147
H  4.967366 0.083114 0.669022
H  2.50275 3.326794 1.635094
H  3.638298 2.103182 2.270485
H  3.886789 2.789885 0.648204
H  3.34685 -3.564782 -1.073993
H  5.29382 -2.23607 -0.250183
H  -3.08462 1.884055 -0.972144
H  -1.981812 -2.033486 0.56055
H  -5.217998 1.819931 0.402577
H  -4.096396 -2.096136 1.939193
H  -5.704253 -0.170882 1.851431
