program: Gaussian 09
title: 000259321
version: EM64L-G09RevD.01
frameworkgroup: C1[X(C9H18N2O3)]
method: RPBEPBE
basis: SDD
operation: Freq
keyword: #p
keyword: freq=noraman
keyword: PBEPBE/SDD
title: #p freq=noraman PBEPBE/SDD
converged: NO YES NO NO
title: Mulliken charges:
elementType: O O O N N C C C C C C C C C H H H H H H H H H H H H H H H H H H
charge: -0.287845 -0.430660 -0.225163 -0.393708 -0.635941 -0.399692 -0.045290 -0.242121 -0.719761 -0.716550 0.206570 -0.110853 -0.675413 0.160665 0.198916 0.190946 0.279155 0.243433 0.219148 0.212737 0.197433 0.215890 0.196566 0.214918 0.280422 0.393862 0.282702 0.287083 0.240354 0.261821 0.213867 0.386510
chargesum: 0.00000
title: Mulliken charges with hydrogens summed into heavy atoms:
elementType: O O O N N C C C C C C C C C
charge: -0.287845 -0.044149 -0.225163 0.000153 -0.066156 -0.009829 0.233865 0.001312 -0.090443 -0.089176 0.206570 0.169569 0.040628 0.160665
polarizability: 1.53195816e+02 -2.85433806e+00 1.17196341e+02 1.74397530e+00 2.27439858e+00 9.71657456e+01
1716.lowfreq: -19.9247 -7.2041 -1.9830 -0.0004 -0.0003 0.0003 13.9220 18.1851 33.3988
frequency: -12.2793 17.5909 33.3471 48.7772 69.6579 90.6614 124.1010 149.6262 199.6590 210.4041 227.9941 241.2358 252.9749 261.1049 276.3631 301.6108 320.1855 367.5392 398.7918 414.0440 449.7529 496.4196 517.3257 546.9893 585.8526 613.2274 697.5746 710.9021 729.4922 783.7463 817.5683 841.5583 868.0537 902.3229 915.0355 921.1002 949.7453 956.5276 1007.4378 1041.3611 1065.3883 1078.9009 1092.0616 1109.6338 1139.1440 1161.6838 1168.4196 1179.7297 1190.4387 1215.3815 1272.3598 1282.4962 1299.6933 1305.9717 1330.0967 1334.8477 1353.4081 1358.7703 1376.4847 1377.9090 1392.2416 1451.9271 1458.3046 1465.8130 1472.9176 1475.1984 1478.7262 1480.6510 1488.1042 1599.9883 1641.7254 1669.2263 2947.1010 2960.9126 2964.8136 2997.2072 2998.2258 3005.6162 3014.0150 3027.9431 3051.3215 3064.7771 3067.0551 3071.0741 3104.7270 3115.7621 3397.1779 3438.0325 3517.6507 3565.8668
redmass: 2.6349 4.3973 9.2496 5.3279 4.1918 3.8199 2.9023 3.0054 1.1674 2.2308 1.3428 1.2155 1.9518 2.0375 2.1003 3.9043 2.5150 2.8993 2.6464 3.1442 2.3948 3.9756 4.2204 3.6045 3.4463 1.3861 3.3549 3.1205 1.5941 3.1789 2.7061 1.1159 2.2532 1.9656 1.3487 1.7315 1.9649 1.4743 2.0067 2.2245 2.0711 2.1971 2.0645 1.8855 1.9576 2.4764 2.0591 1.9534 1.6449 1.4453 1.3728 1.3512 1.9151 1.2154 1.4689 1.3979 1.3791 1.3432 1.2228 1.2035 1.2158 1.1987 1.4985 1.0547 1.0587 1.3435 1.0603 1.0577 1.0490 9.0172 1.0982 8.9383 1.0590 1.0362 1.0377 1.0902 1.0383 1.0778 1.0895 1.0900 1.0982 1.0987 1.0968 1.0982 1.1013 1.1016 1.0770 1.0465 1.0641 1.0962
irintensity: 0.5063 0.1313 0.9580 4.6869 0.7095 2.9483 2.8045 2.0916 0.4227 2.0658 2.4929 1.1086 4.9680 22.5620 4.5930 5.4428 6.6908 2.4331 4.5249 1.6227 4.2532 12.9339 18.3740 36.1837 25.9308 118.3725 36.1482 42.0356 173.4976 3.7824 2.3432 104.2284 39.2109 7.6905 9.1602 17.8156 12.1343 1.7972 151.4123 9.3045 0.6631 5.4541 7.4340 88.3479 3.2072 37.5887 1.9197 23.0430 18.2737 1.1713 5.1359 4.2992 31.3005 4.9385 3.1712 2.7534 3.7921 10.8143 18.5829 29.1808 20.5407 64.0336 232.7202 4.7157 13.8022 129.0643 8.6673 4.8984 26.2114 195.4414 36.4222 236.0100 34.0832 45.5190 37.6312 10.6983 17.3428 14.0081 33.4556 6.6972 15.9315 31.7375 60.2315 78.0382 20.6991 11.1498 142.1320 0.9416 26.3022 3.5896
temp: 298.150 k
press: 1.00000 atm
elementType: 8 8 8 7 7 6 6 6 6 6 6 6 6 6 1 1 1 1 1 1 1 1 1 1 1 1 1 1 1 1 1 1
symmnumber: 1
zpe: 708396.1 jmol-1
zpe.correction: 0.269814 hartree
zpe.thermalcorrener: 0.285939 hartree
zpe.thermalcorrenthalpy: 0.286883 hartree
zpe.thermalcorrgfe: 0.224890 hartree
zpe.sumelectzpe: -687.823108 hartree
zpe.sumelectthermal: -687.806983 hartree
zpe.sumelectthermalent: -687.806039 hartree
zpe.sumelectthermalfe: -687.868032 hartree
dipole: 0.7820 4.4936 1.5655
dipole: 4.8224
quadrupole: -90.0538 -80.9977 -84.8012
quadrupole: -3.3730 -2.2417 -2.3196
quadrupole: -4.7696 4.2866 0.4830 -3.3730 -2.2417 -2.3196
hfenergy: -688.0929219 hartree
pointgroup: C01 [X(C9H18N2O3)]
dipole: -0.3937416 -1.4908267 1.1054501 debye
polarizability: 152.3764432|-6.3207919|115.0318943|-2.754879|-7.1382616|100.1495648 unknown
InChI: InChI=1S/C9H18N2O3/c1-5(2)4-7(10)8(12)11-6(3)9(13)14/h5-7,11,13H,4,10H2,1-3H3
charge 0 multiplicity 1
32 atoms
O  -0.355751 1.444399 -0.538298
O  3.300663 -1.608157 0.269582
O  4.559803 -0.114427 -0.98464
N  1.156842 -0.071256 0.378218
N  -0.649833 -1.691914 1.38252
C  -2.495835 -0.564781 0.038012
C  -3.359083 0.706355 -0.196813
C  -1.213299 -0.397514 0.905052
C  -3.947141 1.258234 1.123991
C  -4.494228 0.381933 -1.196336
C  -0.110742 0.41465 0.171722
C  2.326969 0.578909 -0.20979
C  2.789635 1.822684 0.604896
C  3.500936 -0.3780 -0.37777
H  -2.199094 -0.984349 -0.94611
H  -3.129313 -1.329735 0.53732
H  -2.700403 1.475391 -0.639582
H  -1.472142 0.191213 1.80699
H  -4.579865 2.143395 0.927016
H  -3.159805 1.575292 1.833181
H  -4.578198 0.497846 1.626268
H  -4.087799 0.024615 -2.161095
H  -5.165963 -0.40432 -0.797109
H  -5.109731 1.2777 -1.400229
H  2.046682 0.939321 -1.219417
H  1.216088 -0.92314 0.957982
H  -0.704077 -2.4335 0.672746
H  -1.048379 -2.007913 2.272206
H  3.65391 2.302513 0.115258
H  1.953579 2.539517 0.645904
H  3.070099 1.534608 1.633147
H  4.108575 -2.176572 0.147178
