program: Gaussian 09
title: 000259339
version: EM64L-G09RevD.01
frameworkgroup: C1[X(C16H14ClN3O)]
method: RPBEPBE
basis: SDD
operation: Freq
keyword: #p
keyword: freq=noraman
keyword: PBEPBE/SDD
title: #p freq=noraman PBEPBE/SDD
converged: YES YES NO NO
title: Mulliken charges:
elementType: Cl O N N N C C C C C C C C C C C C C C C C H H H H H H H H H H H H H H
charge: -0.079472 -0.254844 -0.516143 -0.037705 -0.397298 0.329896 0.240091 0.273764 -0.090834 -0.098540 -0.384406 -0.320934 -0.306634 -0.311356 -0.257889 -0.269648 -0.234579 -0.233436 0.246373 -0.327811 -0.552133 0.300800 0.217846 0.240246 0.267141 0.265498 0.228810 0.227569 0.233473 0.231618 0.303428 0.247416 0.269102 0.269879 0.280713
chargesum: 0.00000
title: Mulliken charges with hydrogens summed into heavy atoms:
elementType: Cl O N N N C C C C C C C C C C C C C C C C
charge: -0.079472 -0.254844 -0.215343 -0.037705 -0.093870 0.329896 0.240091 0.273764 -0.090834 -0.098540 -0.166560 -0.080688 -0.039493 -0.045858 -0.029079 -0.042079 -0.001106 -0.001818 0.246373 0.188707 -0.001541
polarizability: 2.74210634e+02 -2.09086095e+01 2.97052563e+02 1.04975534e-01 5.18525741e+00 1.10108232e+02
1716.lowfreq: -3.8141 -0.0014 -0.0009 0.0016 3.3995 5.7570 10.2640 31.4687 48.6659
frequency: 9.5992 31.3843 48.6576 57.2432 69.1155 89.8765 106.9874 120.7226 167.9222 206.6590 232.5579 241.3749 276.9757 293.2921 320.1180 363.1683 398.0411 402.9057 432.2449 440.4891 472.7771 482.1895 503.6636 545.9124 552.2966 583.2347 586.7539 598.3772 613.5014 624.5034 645.4082 687.8175 694.9241 724.4838 747.7533 764.3203 768.7650 799.9013 837.2400 838.8301 866.1370 871.4393 879.5640 920.9704 953.6740 961.0284 962.7117 986.8844 993.8160 994.7026 1019.1574 1022.1648 1029.7578 1078.4313 1110.9292 1135.2046 1154.7317 1160.9827 1175.0091 1190.3524 1205.4328 1225.7294 1237.1518 1251.7528 1284.7453 1291.8886 1299.1077 1356.1375 1367.8034 1371.9807 1396.1013 1426.9210 1438.8521 1440.9415 1442.1820 1452.7098 1457.1231 1481.5855 1485.6657 1526.9494 1551.8981 1560.9276 1613.5346 1633.7169 1650.2709 2999.5530 3057.0981 3067.2264 3120.9244 3133.3607 3137.9919 3150.0012 3153.5802 3155.1360 3169.8909 3171.5616 3184.9749 3515.2269 3536.9833
redmass: 8.6789 6.5977 5.3072 5.9128 7.0871 4.6571 3.5234 4.1752 5.7907 4.7760 5.1898 4.9046 3.7482 4.4183 5.6884 2.9912 6.3426 3.3348 2.9947 2.0682 2.7141 2.0741 3.2723 3.3997 1.7326 3.9016 4.5292 5.6089 5.3277 4.4485 5.7680 4.9713 6.8257 3.6741 3.4346 1.5076 1.4405 2.4068 2.8691 4.9458 1.6292 2.7191 2.7584 4.7790 2.7118 1.3836 1.4143 2.7000 1.3324 1.3285 2.2873 2.0083 1.9667 3.9009 2.0308 1.8798 1.3161 1.1956 1.3157 1.5336 1.6472 1.4330 1.3698 2.8098 1.6746 4.0128 1.2411 2.6027 1.6165 1.8117 2.9964 3.8146 1.2286 1.2280 2.2051 1.8546 3.3148 2.1476 2.6983 6.9043 7.5472 5.2068 5.9309 6.4438 5.6556 1.0597 1.0859 1.0729 1.0859 1.0862 1.0890 1.0905 1.1120 1.0948 1.0973 1.0995 1.0959 1.0755 1.0771
irintensity: 0.6644 0.9103 3.2472 0.8103 7.2670 1.7367 5.3504 8.3393 1.0401 1.1577 3.0813 1.9782 1.0863 2.9089 0.4086 36.9026 1.4398 8.2559 12.6538 13.6834 5.2629 18.9086 0.8529 36.6225 105.6455 9.6478 32.7611 3.1132 6.6072 46.3561 12.2139 1.3010 31.8018 17.2618 2.4303 75.0622 68.8911 16.2973 14.1889 1.7063 0.9788 9.2513 1.8834 5.8093 8.8868 0.2656 0.1817 8.6836 0.3228 0.8393 1.5313 12.3279 5.8885 3.0116 0.1548 14.0612 15.8320 5.5554 4.5969 12.6487 220.0995 5.2045 237.7237 1.8161 0.1825 8.3312 67.3304 17.5864 25.6051 22.0705 2.4843 43.2449 40.7942 34.9931 28.7278 131.4790 40.3712 597.7583 36.0663 35.9153 19.5449 27.1219 12.4502 5.1557 158.7489 50.2075 6.5472 17.3495 3.2525 6.4823 13.4405 14.5898 16.7331 24.1957 24.1471 26.2457 19.9342 11.3895 42.0400
temp: 298.150 k
press: 1.00000 atm
elementType: 17 8 7 7 7 6 6 6 6 6 6 6 6 6 6 6 6 6 6 6 6 1 1 1 1 1 1 1 1 1 1 1 1 1 1
symmnumber: 1
zpe: 704925.0 jmol-1
zpe.correction: 0.268492 hartree
zpe.thermalcorrener: 0.286468 hartree
zpe.thermalcorrenthalpy: 0.287412 hartree
zpe.thermalcorrgfe: 0.219470 hartree
zpe.sumelectzpe: -1316.204701 hartree
zpe.sumelectthermal: -1316.186725 hartree
zpe.sumelectthermalent: -1316.185781 hartree
zpe.sumelectthermalfe: -1316.253724 hartree
dipole: -2.6999 -2.0945 -0.9830
dipole: 3.5556
quadrupole: -127.6616 -109.5337 -137.9977
quadrupole: -4.8177 -7.4686 -0.5256
quadrupole: -2.5972 15.5306 -12.9334 -4.8177 -7.4686 -0.5256
hfenergy: -1316.4731932 hartree
pointgroup: C01 [X(C16H14Cl1N3O1)]
dipole: -1.0093832 0.7709396 0.5862627 debye
polarizability: 274.5063906|23.3620597|290.3963467|-8.2563438|31.6780411|116.4686916 unknown
InChI: InChI=1S/C16H14ClN3O/c17-9-10-18-16(21)20-15-11-5-1-3-7-13(11)19-14-8-4-2-6-12(14)15/h1-8,18,20H,9-10H2
charge 0 multiplicity 1
35 atoms
Cl -6.024102 0.511798 1.768303
O  -2.061307 -0.042519 -1.509254
N  -0.984807 0.715151 0.458927
N  3.067396 -0.617009 -0.155105
N  -3.283852 1.047433 0.165767
C  0.3379 0.251396 0.201268
C  1.410489 1.196799 0.248345
C  0.625362 -1.128002 -0.026421
C  2.77277 0.697525 0.089763
C  2.025052 -1.504064 -0.225078
C  1.215888 2.611754 0.43064
C  -0.368988 -2.167258 -0.027806
C  3.870409 1.624676 0.177471
C  2.349188 -2.884822 -0.473154
C  2.302586 3.480212 0.502742
C  -0.014312 -3.493473 -0.252539
C  3.645111 2.980927 0.388365
C  1.355984 -3.857024 -0.491005
C  -2.107917 0.523488 -0.380355
C  -4.542909 0.994335 -0.578453
C  -5.542017 -0.007527 0.002039
H  -1.06595 1.440691 1.175359
H  0.200601 3.023023 0.472731
H  -1.41711 -1.908834 0.136261
H  4.877462 1.211843 0.064577
H  3.40459 -3.124717 -0.633073
H  2.136163 4.555431 0.630898
H  -0.785299 -4.271618 -0.251205
H  4.487637 3.678045 0.451854
H  1.612463 -4.905726 -0.677178
H  -3.3358 1.305387 1.153743
H  -5.004424 1.998248 -0.625236
H  -4.29021 0.678988 -1.608568
H  -6.487313 -0.024133 -0.560265
H  -5.117431 -1.016528 0.102641
