program: Gaussian 09
title: 000259345
version: EM64L-G09RevD.01
frameworkgroup: C1[X(C11H16N6O4)]
method: RPBEPBE
basis: SDD
operation: Freq
keyword: #p
keyword: freq=noraman
keyword: PBEPBE/SDD
title: #p freq=noraman PBEPBE/SDD
converged: YES YES NO NO
title: Mulliken charges:
elementType: O O O O N N N N N N C C C C C C C C C C C H H H H H H H H H H H H H H H H
charge: -0.297253 -0.417725 -0.426585 -0.433575 -0.210234 -0.083411 -0.250655 -0.116196 -0.617445 -0.594155 -0.174966 -0.026393 -0.175822 -0.072853 -0.423407 0.288523 -0.332708 -0.214585 -0.148955 0.190036 0.045142 0.262552 0.207600 0.201438 0.264017 0.232025 0.216993 0.242346 0.178210 0.339793 0.384391 0.289212 0.331030 0.348408 0.330256 0.330644 0.334305
chargesum: 0.00000
title: Mulliken charges with hydrogens summed into heavy atoms:
elementType: O O O O N N N N N N C C C C C C C C C C C
charge: -0.297253 -0.077931 -0.042194 -0.102545 -0.210234 -0.083411 -0.250655 -0.116196 0.061220 0.070795 0.087586 0.181207 0.025616 0.191164 0.025612 0.288523 0.087849 0.074627 -0.148955 0.190036 0.045142
polarizability: 2.43272090e+02 3.47473541e+00 1.88162257e+02 6.08680344e+00 -8.20369735e+00 1.02257751e+02
1716.lowfreq: -10.6185 -7.7078 -4.9156 0.0003 0.0004 0.0007 19.3378 37.5809 47.2427
frequency: 19.2076 37.4801 47.2245 56.8164 80.2771 86.9362 105.3104 128.2778 137.4980 143.8530 194.5662 204.8736 228.0321 242.6452 253.1466 282.5074 299.2053 313.8901 329.0917 347.3906 351.3784 372.8112 440.9894 448.4614 486.5101 497.1125 499.6075 520.5346 537.3544 553.1714 557.8987 567.2126 605.6041 619.9736 630.3674 656.1417 665.2185 713.6660 761.2626 778.7320 781.5207 819.8378 826.8670 859.8927 894.7247 918.4580 943.9417 963.2247 982.1406 1005.4988 1023.8678 1028.7257 1041.6033 1049.3322 1051.6045 1090.9078 1105.4047 1111.1800 1132.9140 1154.7240 1174.7841 1181.7354 1202.8214 1209.4207 1249.7647 1258.9133 1270.7759 1281.3950 1289.7317 1297.7590 1311.8730 1338.7706 1339.8601 1345.0357 1351.8631 1374.5857 1380.9351 1387.2221 1390.3294 1434.3445 1444.2117 1461.0957 1479.9148 1487.0108 1521.1826 1572.0130 1578.0650 1609.0153 1637.3429 2861.4215 2890.4328 2942.8218 2958.7236 2976.5104 2988.8542 3050.8487 3062.1077 3095.7320 3263.2743 3540.5706 3554.7774 3556.2822 3565.5475 3695.2640 3721.6237
redmass: 5.9275 5.0890 5.0062 6.3949 1.9178 2.1419 2.5480 4.3460 4.7633 3.2044 5.7051 5.2348 6.2707 6.0081 4.4256 4.7955 3.9995 2.1586 2.3615 3.0079 3.7696 4.5536 3.3234 1.2506 5.3622 2.4176 1.4395 1.1861 3.6660 1.0933 4.7264 4.9864 4.9281 4.6284 4.3511 8.1712 6.2492 11.0059 3.1644 2.2753 5.4264 1.6497 5.4250 2.0563 1.1193 2.5616 4.2185 5.6065 4.9912 3.5907 3.9889 3.1439 4.1553 2.3023 3.4838 3.6236 3.2986 1.8334 2.0708 1.3702 2.1106 1.8357 1.7081 1.2576 1.7380 1.8604 1.5706 2.2003 1.3005 1.4029 1.4795 1.3060 1.3541 1.5555 2.8654 1.4590 1.2552 1.5535 4.0672 3.9585 1.0841 4.0898 1.0815 2.3351 1.6986 4.4431 2.5450 1.4913 2.4117 1.0744 1.0772 1.0713 1.0840 1.0626 1.0852 1.0966 1.0870 1.0950 1.0987 1.0443 1.0664 1.0662 1.0445 1.1057 1.1058
irintensity: 2.1524 0.7175 2.4941 5.4080 41.3815 20.8930 12.2522 6.6624 5.2943 37.0300 18.3477 9.2133 3.3368 3.1621 3.0446 11.1838 7.7584 45.4344 49.2347 56.5808 33.1483 7.8112 5.3759 235.3733 2.2023 6.9335 7.0627 290.6339 3.3581 13.0218 13.0140 3.9834 10.7310 7.3784 29.6382 14.8686 8.5144 5.0721 9.3674 22.2377 21.1428 10.2195 7.3806 19.4022 123.8001 15.1571 50.7986 243.3999 20.5508 151.2776 3.3823 7.4738 16.2699 17.0404 52.8949 12.7308 55.1800 10.3686 0.6047 19.4704 3.3719 60.7328 23.7217 25.6655 12.4381 78.7002 17.5600 2.7637 2.8953 45.0454 12.9342 36.2387 2.9740 84.4284 39.5404 9.8588 10.0747 45.7203 35.3372 39.6374 6.1474 119.3891 3.5725 7.0457 207.1888 199.6422 130.3457 575.6384 518.6399 709.0373 402.3235 52.9437 52.8048 15.7975 25.0360 12.9685 28.8385 24.7996 4.6236 128.2463 8.3872 6.6901 125.3706 50.2710 48.9281
temp: 298.150 k
press: 1.00000 atm
elementType: 8 8 8 8 7 7 7 7 7 7 6 6 6 6 6 6 6 6 6 6 6 1 1 1 1 1 1 1 1 1 1 1 1 1 1 1 1
symmnumber: 1
zpe: 754695.1 jmol-1
zpe.correction: 0.287448 hartree
zpe.thermalcorrener: 0.307572 hartree
zpe.thermalcorrenthalpy: 0.308516 hartree
zpe.thermalcorrgfe: 0.237654 hartree
zpe.sumelectzpe: -1056.595609 hartree
zpe.sumelectthermal: -1056.575485 hartree
zpe.sumelectthermalent: -1056.574541 hartree
zpe.sumelectthermalfe: -1056.645402 hartree
dipole: 3.6944 0.6917 2.4255
dipole: 4.4733
quadrupole: -107.3834 -131.4857 -121.0696
quadrupole: -3.2605 -7.4833 -2.3922
quadrupole: 12.5962 -11.5062 -1.0900 -3.2605 -7.4833 -2.3922
hfenergy: -1056.8830567 hartree
pointgroup: C01 [X(C11H16N6O4)]
dipole: -1.4079809 0.275661 -1.0192641 debye
polarizability: 242.2319945|-5.8485341|189.3583522|11.1032722|1.2591935|102.1017511 unknown
InChI: InChI=1S/C11H16N6O4/c12-8-5-9(16-11(13)15-8)17(3-14-5)10-7(20)6(19)4(21-10)1-2-18/h3-4,6-7,10,18-20H,1-2,12-13H2
charge 0 multiplicity 1
37 atoms
O  2.051802 -0.769731 0.51657
O  3.144638 2.326435 -1.236771
O  0.370549 2.499557 0.342941
O  6.253869 -1.915892 0.74943
N  -0.34037 -0.695476 0.336407
N  -1.756169 -2.462174 -0.03813
N  -1.979414 1.172391 0.210355
N  -4.263393 0.360571 -0.232871
N  -4.772965 -1.924694 -0.503399
N  -3.8098 2.635091 0.024294
C  2.585595 1.494572 -0.17904
C  3.07156 0.021476 -0.264392
C  1.052703 1.346205 -0.173315
C  0.867999 0.071352 0.7055
C  4.456885 -0.231753 0.326034
C  -1.612583 -0.145963 0.170538
C  4.926455 -1.689126 0.159461
C  -0.486666 -2.094496 0.210293
C  -2.47098 -1.248216 -0.061093
C  -3.850504 -0.942498 -0.269171
C  -3.33112 1.345382 0.00124
H  2.916122 1.96483 0.763411
H  3.025298 -0.318921 -1.322103
H  0.717565 1.091252 -1.210212
H  0.792131 0.36804 1.771299
H  4.451404 0.028304 1.400936
H  5.164089 0.456671 -0.18286
H  4.258634 -2.371124 0.708826
H  4.915263 -1.97563 -0.915778
H  2.579237 2.255649 -2.047575
H  -0.626638 2.242367 0.342647
H  0.367653 -2.758598 0.2986
H  6.911439 -1.328487 0.297303
H  -4.473467 -2.897321 -0.528676
H  -5.748583 -1.671641 -0.643128
H  -3.179943 3.412607 0.199897
H  -4.802597 2.786592 -0.12817
